program: Orca
programVersion: 5.0.4
elementType: S S P O O O O O N C C C C C C C C C C H H H H H H H H H H H H H H H H H H H H
charge: 0
multiplicity: 1
keywords: wb97x-d3
keywords: def2-TZVPP
keywords: def2/J RIJCOSX
keywords: DEFGRID2
keywords: scfconv7
keywords: smallprint printgap noloewdin
keywords: NOSOSCF
formula: C10H20NO5PS2
InChI: InChI=1/C10H20NO5PS2/c1-5-14-10(13)11(4)9(12)8-19-17(18,15-6-2)16-7-3/h5-8H2,1-4H3
39 atoms
S  -0.011211 1.238248 -0.656502
S  -2.736974 1.221713 1.401766
P  -1.824843 0.396649 -0.075059
O  -2.576582 0.403907 -1.493323
O  -1.447305 -1.147657 0.094156
O  3.566968 -1.059176 -0.90876
O  0.917889 -0.227811 2.610675
O  2.954593 1.069128 -0.597401
N  2.191216 -0.607095 0.782307
C  0.760892 1.459571 0.974793
C  1.302613 0.163629 1.539149
C  -3.366663 1.531479 -1.897606
C  -2.297299 -2.075473 0.785208
C  2.406453 -1.99216 1.190333
C  2.908814 -0.091362 -0.283355
C  -4.835689 1.273953 -1.658263
C  -1.458104 -2.90618 1.724237
C  4.427103 -0.676312 -1.986797
C  5.758804 -0.151184 -1.496174
H  0.013827 1.829305 1.677144
H  1.530282 2.216244 0.847272
H  -3.158749 1.67489 -2.958083
H  -3.046152 2.434991 -1.372404
H  -2.787455 -2.695909 0.032557
H  -3.070357 -1.53975 1.340888
H  1.786864 -2.194693 2.055224
H  3.445232 -2.167121 1.46426
H  2.130089 -2.675567 0.390442
H  -5.420707 2.116568 -2.02864
H  -5.043061 1.161109 -0.595071
H  -5.170859 0.377736 -2.179426
H  -0.676356 -3.445447 1.189766
H  -2.089315 -3.642026 2.222741
H  -0.994461 -2.282721 2.486815
H  3.927508 0.053266 -2.625146
H  4.561718 -1.592686 -2.559873
H  6.410855 0.034133 -2.350104
H  5.648495 0.786706 -0.954899
H  6.256412 -0.874284 -0.849855
totalener: -1961.97318117 hartree
nucrepener: 2128.71364663 hartree
electener: -4090.68682780 hartree
oneelecener: -6935.09530829 hartree
twoeener: 2844.40848050 hartree
kineticenergy: 1956.42731528 hartree
xcener: -132.539829012254 hartree
chargesum: 0.0000000
charge: -0.131465 -0.395728 0.610135 -0.337437 -0.313879 -0.290779 -0.338905 -0.415176 -0.124677 -0.084804 0.216957 0.027210 0.036522 -0.192621 0.466122 -0.228044 -0.248034 0.027125 -0.250641 0.144075 0.145486 0.095295 0.085109 0.094583 0.080513 0.113124 0.118068 0.116912 0.079516 0.084611 0.082844 0.077039 0.091855 0.099432 0.093390 0.096715 0.085524 0.101013 0.083013
qa: -0.1315 -0.3957 0.6101 -0.3374 -0.3139 -0.2908 -0.3389 -0.4152 -0.1247 -0.0848 0.2170 0.0272 0.0365 -0.1926 0.4661 -0.2280 -0.2480 0.0271 -0.2506 0.1441 0.1455 0.0953 0.0851 0.0946 0.0805 0.1131 0.1181 0.1169 0.0795 0.0846 0.0828 0.0770 0.0919 0.0994 0.0934 0.0967 0.0855 0.1010 0.0830
va: 2.3092 2.0468 5.4399 2.1042 2.1165 2.1281 2.1447 2.0623 3.1453 3.8035 4.1168 3.8845 3.8559 3.8792 4.2727 3.9241 3.9225 3.8783 3.9106 1.0437 1.0153 0.9935 1.0120 0.9945 1.0239 1.0229 1.0010 0.9952 1.0118 1.0257 1.0045 1.0026 1.0135 1.0129 1.0110 0.9940 1.0102 1.0127 1.0056
dispcorr: -0.019846908 hartree
energy: -1961.993028075276
dipole: 5.09307 -4.30450 0.78857 -11.04680 10.07226 -0.97454 -4.95284 3.77008 -1.18276
magnitude: 1.72351 au
magnitude: 4.38082 debye
