program: Orca
programVersion: 5.0.4
elementType: S S P O O O O O N C C C C C C C C C C H H H H H H H H H H H H H H H H H H H H
charge: 0
multiplicity: 1
keywords: wb97x-d3
keywords: def2-TZVPP
keywords: def2/J RIJCOSX
keywords: DEFGRID2
keywords: scfconv7
keywords: smallprint printgap noloewdin
keywords: NOSOSCF
formula: C10H20NO5PS2
InChI: InChI=1/C10H20NO5PS2/c1-5-14-10(13)11(4)9(12)8-19-17(18,15-6-2)16-7-3/h5-8H2,1-4H3
39 atoms
S  0.53331 -1.12334 0.2269
S  -2.380053 -0.592011 1.939223
P  -1.482397 -0.573535 0.241125
O  -1.440031 0.825088 -0.528455
O  -2.030952 -1.573846 -0.881941
O  3.226931 -0.079979 -0.29634
O  0.701797 2.395154 1.460499
O  2.933832 1.017843 -2.219635
N  1.917883 1.755034 -0.312117
C  1.15498 0.084519 1.436418
C  1.2584 1.49458 0.883195
C  -2.374168 1.881106 -0.253055
C  -2.559379 -2.864716 -0.545461
C  1.653391 3.065114 -0.898031
C  2.706919 0.880085 -1.05016
C  -3.733512 1.607315 -0.85284
C  -4.068646 -2.849806 -0.597342
C  3.915543 -1.134302 -0.977976
C  4.294064 -2.172528 0.050734
H  2.109998 -0.291789 1.795436
H  0.468863 0.125329 2.282651
H  -1.92133 2.769648 -0.6908
H  -2.441025 2.035642 0.825244
H  -2.214196 -3.178389 0.442976
H  -2.144894 -3.557243 -1.278553
H  1.929993 3.85264 -0.201797
H  0.597373 3.170236 -1.141586
H  2.230214 3.170465 -1.808665
H  -4.214519 0.754656 -0.373538
H  -3.666387 1.414778 -1.922987
H  -4.377724 2.474416 -0.704617
H  -4.452781 -3.854353 -0.417586
H  -4.427503 -2.521585 -1.57247
H  -4.477448 -2.191163 0.16787
H  4.798582 -0.730873 -1.477008
H  3.265118 -1.560173 -1.744535
H  4.841027 -2.980348 -0.434553
H  4.936936 -1.756541 0.82621
H  3.413829 -2.60783 0.524637
totalener: -1961.97100222 hartree
nucrepener: 2166.08975418 hartree
electener: -4128.06075640 hartree
oneelecener: -7009.28616863 hartree
twoeener: 2881.22541223 hartree
kineticenergy: 1956.42141256 hartree
xcener: -132.537551347983 hartree
chargesum: -0.0000000
charge: -0.168243 -0.385002 0.601663 -0.320633 -0.326152 -0.307222 -0.341359 -0.369563 -0.115527 -0.054617 0.181604 0.030661 0.029064 -0.167332 0.426469 -0.221179 -0.234666 0.008690 -0.236263 0.138621 0.137947 0.086451 0.106163 0.085991 0.096909 0.115659 0.104430 0.115145 0.076811 0.090078 0.085806 0.085190 0.087932 0.083097 0.106122 0.105966 0.089994 0.089587 0.081707
qa: -0.1682 -0.3850 0.6017 -0.3206 -0.3262 -0.3072 -0.3414 -0.3696 -0.1155 -0.0546 0.1816 0.0307 0.0291 -0.1673 0.4265 -0.2212 -0.2347 0.0087 -0.2363 0.1386 0.1379 0.0865 0.1062 0.0860 0.0969 0.1157 0.1044 0.1151 0.0768 0.0901 0.0858 0.0852 0.0879 0.0831 0.1061 0.1060 0.0900 0.0896 0.0817
va: 2.2869 2.0487 5.4717 2.1224 2.1116 2.0768 2.1422 2.1387 3.1429 3.7864 4.1645 3.8634 3.8732 3.8975 4.3317 3.9220 3.9235 3.8514 3.9339 1.0094 1.0516 0.9895 1.0129 1.0123 0.9933 0.9946 0.9952 1.0189 1.0188 1.0062 1.0110 1.0131 1.0032 1.0188 1.0017 1.0008 1.0116 1.0024 1.0072
dispcorr: -0.021237059 hartree
energy: -1961.992239278223
dipole: -3.80024 4.10910 0.30885 -3.83900 3.00041 -0.83859 -6.38293 5.93121 -0.45172
magnitude: 1.00134 au
magnitude: 2.54520 debye
