program: Orca
programVersion: 5.0.4
elementType: S S P O O O O O O C C C C C C C C C C H H H H H H H H H H H H H H H H H H H
charge: 0
multiplicity: 1
keywords: wb97x-d3
keywords: def2-TZVPP
keywords: def2/J RIJCOSX
keywords: DEFGRID2
keywords: scfconv7
keywords: smallprint printgap noloewdin
keywords: NOSOSCF
formula: C10H19O6PS2
InChI: InChI=1/C10H19O6PS2/c1-5-15-9(11)7-8(10(12)16-6-2)19-17(18,13-3)14-4/h8H,5-7H2,1-4H3
38 atoms
S  -0.74449 0.553955 -0.63663
S  -2.689307 -0.602465 1.915203
P  -2.068159 -0.878723 0.118986
O  0.868962 2.758123 -0.481475
O  2.487619 -1.99262 0.548813
O  -1.383764 -2.310324 -0.051867
O  -3.155869 -0.89956 -1.054949
O  2.040633 2.385012 1.38763
O  2.452006 -0.079618 -0.615879
C  0.263189 0.895285 0.852248
C  1.065481 -0.304453 1.324312
C  1.167743 2.090193 0.608696
C  2.064136 -0.766912 0.299691
C  1.655286 3.918809 -0.825336
C  3.516827 -2.559097 -0.285525
C  1.208228 5.150041 -0.075309
C  2.952518 -3.186018 -1.538173
C  -0.79964 -2.754323 -1.284802
C  -4.125749 0.146044 -1.184893
H  -0.426688 1.185215 1.651684
H  1.615129 -0.032444 2.230638
H  0.40981 -1.120898 1.624409
H  2.712752 3.707775 -0.663231
H  1.497659 4.039661 -1.894953
H  4.266894 -1.802843 -0.518517
H  3.988245 -3.313567 0.34151
H  0.150756 5.354173 -0.241328
H  1.77369 6.006263 -0.443945
H  1.385932 5.072106 0.99626
H  2.21827 -3.955961 -1.302211
H  3.766116 -3.660839 -2.087426
H  2.491508 -2.452246 -2.198451
H  -1.571497 -3.000562 -2.012752
H  -0.227905 -3.648335 -1.052145
H  -0.130962 -2.002528 -1.705178
H  -4.650651 0.313187 -0.244327
H  -4.836263 -0.178728 -1.940103
H  -3.658572 1.076295 -1.509153
elementType: S P O C H
totalener: -1981.84910410 hartree
nucrepener: 2137.78526240 hartree
electener: -4119.63436649 hartree
oneelecener: -6982.54087561 hartree
twoeener: 2862.90650912 hartree
cpcmener: -0.03699096 hartree
kineticenergy: 1976.20375553 hartree
xcener: -133.550215829291 hartree
chargesum: 0.0000000
charge: -0.165315 -0.433939 0.650827 -0.268373 -0.290448 -0.339747 -0.350461 -0.474647 -0.470957 0.061064 -0.145477 0.389258 0.417192 0.031796 0.047684 -0.250141 -0.280573 -0.122990 -0.105422 0.138825 0.132619 0.110816 0.095727 0.111564 0.093711 0.112639 0.089768 0.099005 0.088367 0.090175 0.108491 0.094534 0.139019 0.134148 0.105059 0.109123 0.130745 0.116335
qa: -0.1653 -0.4339 0.6508 -0.2684 -0.2904 -0.3397 -0.3505 -0.4746 -0.4710 0.0611 -0.1455 0.3893 0.4172 0.0318 0.0477 -0.2501 -0.2806 -0.1230 -0.1054 0.1388 0.1326 0.1108 0.0957 0.1116 0.0937 0.1126 0.0898 0.0990 0.0884 0.0902 0.1085 0.0945 0.1390 0.1341 0.1051 0.1091 0.1307 0.1163
va: 2.3203 2.0386 5.4164 2.1488 2.1419 2.0788 2.0886 2.0272 2.0063 3.9139 3.8211 4.2199 4.1107 3.8503 3.8338 3.9209 3.9206 3.8470 3.8488 1.0356 1.0267 1.0498 1.0094 0.9959 1.0109 0.9948 1.0042 1.0063 1.0134 1.0013 1.0097 1.0055 0.9936 0.9863 0.9969 1.0007 0.9904 0.9916
dispcorr: -0.019757357 hartree
energy: -1981.868861455868
dipole: 12.23896 -12.01127 0.22769 2.15994 -2.49291 -0.33297 -10.64394 8.65789 -1.98605
magnitude: 2.02660 au
magnitude: 5.15120 debye
