program: Orca
programVersion: 5.0.4
elementType: S S P O O O O O O C C C C C C C C C C H H H H H H H H H H H H H H H H H H H
charge: 0
multiplicity: 1
keywords: wb97x-d3
keywords: def2-TZVPP
keywords: def2/J RIJCOSX
keywords: DEFGRID2
keywords: scfconv7
keywords: smallprint printgap noloewdin
keywords: NOSOSCF
formula: C10H19O6PS2
InChI: InChI=1/C10H19O6PS2/c1-5-15-9(11)7-8(10(12)16-6-2)19-17(18,13-3)14-4/h8H,5-7H2,1-4H3
38 atoms
S  -1.00718 0.894692 -0.707276
S  -1.895593 -2.303072 0.032973
P  -2.435354 -0.461512 0.004046
O  0.709315 1.809537 1.81938
O  3.401975 -1.572705 -1.245121
O  -3.667763 -0.048363 -0.926207
O  -2.905017 0.040325 1.439548
O  2.0945 2.04777 0.073775
O  2.921161 -0.896768 0.835373
C  0.516415 0.24176 0.089132
C  1.350968 -0.496282 -0.934724
C  1.215283 1.460911 0.654361
C  2.635196 -0.999897 -0.335242
C  1.126097 3.05796 2.408581
C  4.66128 -2.142753 -0.837826
C  0.423291 4.234879 1.775346
C  4.49449 -3.517385 -0.234688
C  -3.762297 -0.498823 -2.283287
C  -3.213977 1.409923 1.735268
H  0.221485 -0.421695 0.903722
H  0.78267 -1.353143 -1.306528
H  1.570531 0.12898 -1.802461
H  0.853058 2.964577 3.457364
H  2.21061 3.155108 2.350531
H  5.242248 -2.19566 -1.756519
H  5.175544 -1.463964 -0.156428
H  -0.660282 4.129141 1.835628
H  0.702274 4.375071 0.731632
H  0.699496 5.140994 2.315302
H  3.989515 -4.194437 -0.92368
H  3.940245 -3.495921 0.703151
H  5.481671 -3.931438 -0.026273
H  -2.988334 -0.044439 -2.901374
H  -4.737734 -0.18761 -2.646427
H  -3.684192 -1.583166 -2.342022
H  -4.008633 1.788237 1.094325
H  -2.328958 2.038077 1.634655
H  -3.548288 1.429204 2.768515
elementType: S P O C H
totalener: -1981.84961284 hartree
nucrepener: 2086.89182968 hartree
electener: -4068.74144252 hartree
oneelecener: -6880.76821501 hartree
twoeener: 2812.02677249 hartree
cpcmener: -0.03683358 hartree
kineticenergy: 1976.19675029 hartree
xcener: -133.545062732665 hartree
chargesum: -0.0000000
charge: -0.182420 -0.427856 0.657166 -0.273980 -0.294589 -0.344820 -0.338187 -0.458289 -0.482039 0.098459 -0.181218 0.360038 0.451587 0.037313 0.041266 -0.262678 -0.255405 -0.103016 -0.097329 0.116560 0.118746 0.121067 0.113805 0.100292 0.111969 0.092865 0.093112 0.091828 0.106085 0.089232 0.088836 0.097917 0.117126 0.131579 0.111556 0.133137 0.088674 0.131611
qa: -0.1824 -0.4279 0.6572 -0.2740 -0.2946 -0.3448 -0.3382 -0.4583 -0.4820 0.0985 -0.1812 0.3600 0.4516 0.0373 0.0413 -0.2627 -0.2554 -0.1030 -0.0973 0.1166 0.1187 0.1211 0.1138 0.1003 0.1120 0.0929 0.0931 0.0918 0.1061 0.0892 0.0888 0.0979 0.1171 0.1316 0.1116 0.1331 0.0887 0.1316
va: 2.2668 2.0322 5.4185 2.1502 2.1483 2.0892 2.1087 2.0376 2.0050 3.7451 3.9113 4.2462 4.1302 3.8199 3.8401 3.9289 3.9207 3.8424 3.8472 1.0664 1.0396 1.0277 0.9974 1.0103 0.9957 1.0100 0.9987 1.0102 1.0076 1.0044 1.0121 1.0064 0.9911 0.9907 1.0007 0.9913 0.9974 0.9909
dispcorr: -0.018394645 hartree
energy: -1981.868007488593
dipole: 10.92577 -11.68767 -0.76190 6.26116 -4.97289 1.28827 1.73883 -2.34944 -0.61062
magnitude: 1.61647 au
magnitude: 4.10874 debye
