program: Orca
programVersion: 5.0.4
elementType: S S P O O O O O O C C C C C C C C C C H H H H H H H H H H H H H H H H H H H
charge: 0
multiplicity: 1
keywords: wb97x-d3
keywords: def2-TZVPP
keywords: def2/J RIJCOSX
keywords: DEFGRID2
keywords: scfconv7
keywords: smallprint printgap noloewdin
keywords: NOSOSCF
formula: C10H19O6PS2
InChI: InChI=1/C10H19O6PS2/c1-5-15-9(11)7-8(10(12)16-6-2)19-17(18,13-3)14-4/h8H,5-7H2,1-4H3
38 atoms
S  -1.424237 -1.056157 0.225177
S  -1.676887 2.154614 1.380228
P  -2.341665 0.83327 0.161678
O  1.017334 1.004459 -0.97083
O  2.915304 -0.524605 1.190566
O  -3.86778 0.376357 0.317296
O  -2.305311 1.332502 -1.348678
O  1.397946 -1.133013 -1.522415
O  3.09459 -2.616592 1.966326
C  0.328084 -0.633999 0.562491
C  0.964249 -1.853085 1.211766
C  0.983307 -0.295083 -0.759404
C  2.439368 -1.718386 1.495926
C  1.602099 1.485077 -2.199378
C  4.321785 -0.259734 1.368358
C  0.616786 1.462664 -3.342541
C  5.141863 -0.784113 0.213329
C  -4.396632 -0.003691 1.592571
C  -2.794487 0.541863 -2.442014
H  0.337587 0.220369 1.240917
H  0.469757 -2.059409 2.163452
H  0.836325 -2.748146 0.59873
H  1.906791 2.504632 -1.972609
H  2.499933 0.910804 -2.429348
H  4.385861 0.824986 1.426631
H  4.659154 -0.667238 2.321588
H  1.107314 1.855001 -4.233628
H  -0.246497 2.093752 -3.13676
H  0.271055 0.455217 -3.572602
H  4.795708 -0.377353 -0.737244
H  5.125888 -1.871746 0.154554
H  6.178473 -0.475047 0.349743
H  -4.203088 0.764237 2.341537
H  -3.97197 -0.950511 1.926861
H  -5.46951 -0.11794 1.463915
H  -2.335835 -0.447607 -2.4551
H  -2.521327 1.069016 -3.351274
H  -3.877841 0.442637 -2.396862
elementType: S P O C H
totalener: -1981.84968397 hartree
nucrepener: 2137.86937057 hartree
electener: -4119.71905454 hartree
oneelecener: -6982.30789200 hartree
twoeener: 2862.58883746 hartree
cpcmener: -0.03892487 hartree
kineticenergy: 1976.19223819 hartree
xcener: -133.545308725538 hartree
chargesum: -0.0000000
charge: -0.180666 -0.423668 0.656505 -0.269656 -0.271056 -0.348042 -0.336176 -0.469484 -0.484813 0.119475 -0.208289 0.351016 0.449838 0.042022 0.014119 -0.270515 -0.252957 -0.103725 -0.134565 0.121299 0.132710 0.124014 0.113713 0.094815 0.111640 0.100436 0.110494 0.088592 0.093705 0.089345 0.089963 0.102914 0.110000 0.115606 0.130598 0.120938 0.126292 0.143561
qa: -0.1807 -0.4237 0.6565 -0.2697 -0.2711 -0.3480 -0.3362 -0.4695 -0.4848 0.1195 -0.2083 0.3510 0.4498 0.0420 0.0141 -0.2705 -0.2530 -0.1037 -0.1346 0.1213 0.1327 0.1240 0.1137 0.0948 0.1116 0.1004 0.1105 0.0886 0.0937 0.0893 0.0900 0.1029 0.1100 0.1156 0.1306 0.1209 0.1263 0.1436
va: 2.2797 2.0506 5.4192 2.1479 2.1306 2.0886 2.0979 2.0227 2.0195 3.7492 3.9441 4.1758 4.1411 3.8355 3.8437 3.9181 3.9258 3.8474 3.8396 1.0660 1.0172 1.0239 0.9953 1.0094 0.9971 1.0090 1.0091 1.0058 1.0076 1.0025 1.0121 1.0074 1.0007 0.9921 0.9907 0.9927 0.9836 0.9965
dispcorr: -0.020442669 hartree
energy: -1981.870126636283
dipole: 12.33456 -13.09141 -0.75685 -0.11740 0.68571 0.56831 -10.50432 9.60132 -0.90300
magnitude: 1.30813 au
magnitude: 3.32501 debye
