program: Orca
programVersion: 5.0.4
elementType: S S P O O O O O O C C C C C C C C C C H H H H H H H H H H H H H H H H H H H
charge: 0
multiplicity: 1
keywords: wb97x-d3
keywords: def2-TZVPP
keywords: def2/J RIJCOSX
keywords: DEFGRID2
keywords: scfconv7
keywords: smallprint printgap noloewdin
keywords: NOSOSCF
formula: C10H19O6PS2
InChI: InChI=1/C10H19O6PS2/c1-5-15-9(11)7-8(10(12)16-6-2)19-17(18,13-3)14-4/h8H,5-7H2,1-4H3
38 atoms
S  -1.120473 0.059951 1.75333
S  -4.113524 -0.41323 0.538273
P  -2.275653 -0.169568 0.04182
O  0.772403 2.139144 0.186794
O  3.029229 -2.545071 0.259383
O  -1.532422 -1.335924 -0.749625
O  -1.969389 1.085585 -0.909329
O  1.150542 0.357366 -1.107354
O  3.358935 -0.433068 0.921321
C  0.637693 0.028301 1.211685
C  1.163218 -1.387915 1.071568
C  0.876739 0.84862 -0.041609
C  2.633435 -1.381321 0.741424
C  1.025338 3.037479 -0.910891
C  4.398934 -2.695404 -0.156236
C  0.863384 4.444386 -0.398458
C  4.623229 -2.144738 -1.545769
C  -1.828881 -1.605813 -2.128718
C  -2.570108 2.35807 -0.654615
H  1.137001 0.530068 2.044744
H  1.035677 -1.916451 2.020691
H  0.614151 -1.956037 0.323395
H  2.038253 2.871746 -1.283378
H  0.328075 2.829426 -1.724305
H  5.069839 -2.236363 0.571244
H  4.572582 -3.770147 -0.136998
H  1.56763 4.664793 0.404264
H  -0.147885 4.63306 -0.036804
H  1.060594 5.141531 -1.212987
H  3.952681 -2.610055 -2.269296
H  5.646746 -2.362507 -1.854308
H  4.486739 -1.064312 -1.591845
H  -2.900703 -1.563022 -2.326788
H  -1.474384 -2.613095 -2.330042
H  -1.307566 -0.903634 -2.77748
H  -2.250144 3.021425 -1.454742
H  -2.247263 2.763942 0.305782
H  -3.658282 2.284846 -0.665483
elementType: S P O C H
totalener: -1981.85935719 hartree
nucrepener: 2141.39083232 hartree
electener: -4123.25018951 hartree
oneelecener: -6989.72249132 hartree
twoeener: 2866.47230181 hartree
cpcmener: -0.03087903 hartree
kineticenergy: 1976.17647684 hartree
xcener: -133.540084499005 hartree
chargesum: -0.0000000
charge: -0.149984 -0.424223 0.606048 -0.265446 -0.287450 -0.330578 -0.319864 -0.429079 -0.459080 0.127999 -0.190704 0.306980 0.412238 0.001754 0.041419 -0.244350 -0.255461 -0.106493 -0.121341 0.128857 0.125825 0.123058 0.123561 0.108446 0.091909 0.108593 0.092176 0.087616 0.090931 0.089327 0.095897 0.089726 0.115650 0.125113 0.117765 0.125111 0.117898 0.130157
qa: -0.1500 -0.4242 0.6060 -0.2654 -0.2874 -0.3306 -0.3199 -0.4291 -0.4591 0.1280 -0.1907 0.3070 0.4122 0.0018 0.0414 -0.2444 -0.2555 -0.1065 -0.1213 0.1289 0.1258 0.1231 0.1236 0.1084 0.0919 0.1086 0.0922 0.0876 0.0909 0.0893 0.0959 0.0897 0.1156 0.1251 0.1178 0.1251 0.1179 0.1302
va: 2.3039 2.0601 5.4372 2.1566 2.1483 2.0974 2.0540 2.0511 2.0353 3.7908 3.9118 4.2288 4.1823 3.8192 3.8465 3.9617 3.9194 3.8465 3.8348 1.0379 1.0174 1.0394 0.9998 0.9925 1.0108 0.9958 1.0031 1.0015 1.0065 1.0044 1.0072 1.0132 1.0028 0.9895 0.9938 0.9858 0.9923 1.0073
dispcorr: -0.020612826 hartree
energy: -1981.879970014832
dipole: 18.78226 -17.54608 1.23618 7.54285 -6.88336 0.65950 -13.48502 12.35116 -1.13386
magnitude: 1.80242 au
magnitude: 4.58138 debye
