program: Orca
programVersion: 5.0.4
elementType: S S P O O O O O O C C C C C C C C C C H H H H H H H H H H H H H H H H H H H
charge: 0
multiplicity: 1
keywords: wb97x-d3
keywords: def2-TZVPP
keywords: def2/J RIJCOSX
keywords: DEFGRID2
keywords: scfconv7
keywords: smallprint printgap noloewdin
keywords: NOSOSCF
formula: C10H19O6PS2
InChI: InChI=1/C10H19O6PS2/c1-5-15-9(11)7-8(10(12)16-6-2)19-17(18,13-3)14-4/h8H,5-7H2,1-4H3
38 atoms
S  -0.864484 0.635046 -0.466944
S  -2.737762 -0.892534 1.945992
P  -2.118675 -0.93008 0.127773
O  0.541277 2.936523 0.029983
O  2.557479 -1.846951 0.290446
O  -1.382775 -2.30484 -0.207599
O  -3.209667 -0.855062 -1.042369
O  1.96256 2.283131 1.627967
O  2.340795 0.182905 -0.626493
C  0.171338 0.82539 1.031268
C  1.047595 -0.381363 1.310912
C  1.008213 2.089694 0.920143
C  2.0373 -0.635993 0.206405
C  1.272986 4.151106 -0.224756
C  3.605172 -2.218837 -0.623145
C  2.436184 3.912619 -1.158291
C  3.0699 -2.689782 -1.954618
C  -0.798722 -2.596592 -1.48174
C  -4.228588 0.14822 -1.047716
H  -0.507789 0.969117 1.878751
H  1.609959 -0.20919 2.233968
H  0.445814 -1.268646 1.505519
H  0.540955 4.815371 -0.680707
H  1.593889 4.600972 0.715672
H  4.306156 -1.391749 -0.74544
H  4.130306 -3.026938 -0.115982
H  2.896334 4.8717 -1.399602
H  2.108087 3.457134 -2.093052
H  3.20438 3.280814 -0.713509
H  2.375377 -3.521732 -1.834598
H  3.904434 -3.043242 -2.562039
H  2.573463 -1.894035 -2.508876
H  -0.1689 -3.470974 -1.340341
H  -0.186755 -1.770244 -1.845808
H  -1.569064 -2.826532 -2.217608
H  -4.787799 0.146425 -0.111254
H  -4.90183 -0.093487 -1.866696
H  -3.80636 1.140446 -1.214252
elementType: S P O C H
totalener: -1981.85618365 hartree
nucrepener: 2145.07403703 hartree
electener: -4126.93022068 hartree
oneelecener: -6997.05279137 hartree
twoeener: 2870.12257068 hartree
cpcmener: -0.03033264 hartree
kineticenergy: 1976.20041742 hartree
xcener: -133.547679691480 hartree
chargesum: 0.0000000
charge: -0.164541 -0.429755 0.645653 -0.267614 -0.287566 -0.331745 -0.345536 -0.444235 -0.446630 0.061579 -0.147373 0.363922 0.403701 0.031814 0.046992 -0.252744 -0.278503 -0.122738 -0.108037 0.133831 0.130025 0.110395 0.110140 0.094131 0.092329 0.109927 0.099678 0.090465 0.089668 0.087719 0.106219 0.094792 0.130744 0.104085 0.136222 0.110047 0.128813 0.114124
qa: -0.1645 -0.4298 0.6457 -0.2676 -0.2876 -0.3317 -0.3455 -0.4442 -0.4466 0.0616 -0.1474 0.3639 0.4037 0.0318 0.0470 -0.2527 -0.2785 -0.1227 -0.1080 0.1338 0.1300 0.1104 0.1101 0.0941 0.0923 0.1099 0.0997 0.0905 0.0897 0.0877 0.1062 0.0948 0.1307 0.1041 0.1362 0.1100 0.1288 0.1141
va: 2.3214 2.0430 5.4214 2.1447 2.1408 2.0861 2.0904 2.0627 2.0293 3.9076 3.8355 4.2591 4.1221 3.8468 3.8422 3.9153 3.9167 3.8511 3.8534 1.0370 1.0272 1.0478 0.9957 1.0095 1.0104 0.9950 1.0079 1.0047 1.0148 1.0022 1.0098 1.0077 0.9874 0.9979 0.9937 1.0003 0.9905 0.9918
dispcorr: -0.020112604 hartree
energy: -1981.876296254121
dipole: 15.29419 -14.97355 0.32063 1.49440 -1.60652 -0.11212 -14.21123 12.23346 -1.97777
magnitude: 2.00673 au
magnitude: 5.10070 debye
