program: Orca
programVersion: 5.0.4
elementType: S S P O O O O O O C C C C C C C C C C H H H H H H H H H H H H H H H H H H H
charge: 0
multiplicity: 1
keywords: wb97x-d3
keywords: def2-TZVPP
keywords: def2/J RIJCOSX
keywords: DEFGRID2
keywords: scfconv7
keywords: smallprint printgap noloewdin
keywords: NOSOSCF
formula: C10H19O6PS2
InChI: InChI=1/C10H19O6PS2/c1-5-15-9(11)7-8(10(12)16-6-2)19-17(18,13-3)14-4/h8H,5-7H2,1-4H3
38 atoms
S  -1.432696 0.158368 1.472224
S  -1.227694 -0.350086 -1.90365
P  -2.375122 -0.22408 -0.365733
O  0.163497 2.164957 0.007976
O  2.847075 -2.257103 0.086614
O  -3.542871 0.862785 -0.399287
O  -3.323969 -1.473931 -0.066967
O  1.796001 0.780164 -0.641819
O  3.053752 -0.73549 1.714617
C  0.355419 0.094741 1.131954
C  0.866512 -1.321608 0.921766
C  0.838504 1.038701 0.043034
C  2.373772 -1.37685 0.95126
C  0.534819 3.160314 -0.963008
C  4.270866 -2.410558 -0.036769
C  1.708325 3.993332 -0.505836
C  4.867747 -1.349866 -0.932704
C  -3.254143 2.238967 -0.65627
C  -2.771975 -2.78756 0.033004
H  0.770683 0.48599 2.069177
H  0.508466 -1.951123 1.740753
H  0.479918 -1.743492 -0.004655
H  0.727265 2.685529 -1.926147
H  -0.355524 3.778255 -1.067987
H  4.741263 -2.41663 0.947569
H  4.401022 -3.399529 -0.47356
H  2.624923 3.410678 -0.423006
H  1.508379 4.467794 0.455297
H  1.883189 4.784816 -1.235493
H  4.794933 -0.352334 -0.500403
H  4.385625 -1.340535 -1.910656
H  5.925367 -1.567962 -1.085382
H  -2.701086 2.683669 0.171069
H  -4.212716 2.742494 -0.75264
H  -2.694833 2.360473 -1.584244
H  -2.195022 -3.046712 -0.855113
H  -3.611835 -3.471865 0.121518
H  -2.141879 -2.88413 0.91858
elementType: S P O C H
totalener: -1981.85513655 hartree
nucrepener: 2153.09406733 hartree
electener: -4134.94920388 hartree
oneelecener: -7013.31389130 hartree
twoeener: 2878.36468743 hartree
cpcmener: -0.03143246 hartree
kineticenergy: 1976.21239799 hartree
xcener: -133.551488055531 hartree
chargesum: 0.0000000
charge: -0.170732 -0.420557 0.662296 -0.271967 -0.282663 -0.336901 -0.334640 -0.434118 -0.464694 0.126271 -0.175404 0.339767 0.392032 0.050906 0.045846 -0.257041 -0.257725 -0.118477 -0.122210 0.122145 0.128455 0.105373 0.093745 0.102817 0.089255 0.107136 0.091247 0.088333 0.097032 0.088681 0.089638 0.098102 0.114047 0.134784 0.112471 0.116579 0.135958 0.114209
qa: -0.1707 -0.4206 0.6623 -0.2720 -0.2827 -0.3369 -0.3346 -0.4341 -0.4647 0.1263 -0.1754 0.3398 0.3920 0.0509 0.0458 -0.2570 -0.2577 -0.1185 -0.1222 0.1221 0.1285 0.1054 0.0937 0.1028 0.0893 0.1071 0.0912 0.0883 0.0970 0.0887 0.0896 0.0981 0.1140 0.1348 0.1125 0.1166 0.1360 0.1142
va: 2.2819 2.0324 5.3914 2.1460 2.1419 2.1155 2.1095 2.0455 2.0370 3.8070 3.8938 4.2488 4.2616 3.8297 3.8430 3.9465 3.9148 3.8518 3.8520 1.0346 1.0137 1.0545 1.0115 0.9923 1.0120 0.9963 1.0128 1.0043 1.0054 1.0141 1.0048 1.0081 0.9925 0.9928 0.9976 0.9991 0.9911 0.9890
dispcorr: -0.020591060 hartree
energy: -1981.875727606930
dipole: 16.66978 -17.13329 -0.46350 5.25177 -5.01021 0.24156 -3.70860 3.97617 0.26757
magnitude: 0.58718 au
magnitude: 1.49249 debye
