program: Gaussian 09
title: 000064054
version: EM64L-G09RevD.01
frameworkgroup: C1[X(C10H10N2O)]
method: RPBEPBE
basis: SDD
operation: Freq
keyword: #p
keyword: freq=noraman
keyword: PBEPBE/SDD
title: #p freq=noraman PBEPBE/SDD
converged: YES YES NO NO
title: Mulliken charges:
elementType: O N N C C C C C C C C C C H H H H H H H H H H
charge: -0.228789 -0.169361 0.013347 0.399480 -0.361115 0.058719 -0.340336 -0.253635 -0.326061 -0.659233 -0.037088 -0.230223 -0.244429 0.230594 0.224830 0.239050 0.228876 0.280521 0.235506 0.242078 0.227241 0.232611 0.237419
chargesum: 0.00000
title: Mulliken charges with hydrogens summed into heavy atoms:
elementType: O N N C C C C C C C C C C
charge: -0.228789 -0.169361 0.013347 0.399480 0.094309 0.058719 -0.101286 -0.024759 -0.045540 0.045592 -0.037088 0.002388 -0.007011
polarizability: 1.55480004e+02 -9.93188693e-01 1.50407405e+02 8.29414038e+00 -1.70037039e+00 6.05970805e+01
1716.lowfreq: -16.3184 -8.3834 -3.9479 -0.0008 0.0004 0.0005 64.7529 79.9684 109.2352
frequency: 64.7414 79.7147 109.2283 165.2556 200.1145 235.2638 285.6925 349.2133 375.3051 413.0862 461.9579 481.6324 487.5045 522.2086 564.7754 585.0007 674.6458 686.1892 755.2432 769.6355 777.6733 793.4897 794.5184 873.9128 916.4708 948.8369 970.0962 986.6385 1004.9870 1038.5652 1047.7346 1086.6876 1113.8733 1133.2624 1176.4029 1204.4863 1221.3091 1258.6749 1280.0077 1344.8849 1368.9953 1391.1367 1393.7989 1399.5113 1455.2055 1460.3961 1468.9402 1482.2390 1496.4870 1538.5569 1584.7397 1591.5497 1620.9274 2994.5050 3014.2311 3064.8191 3093.5944 3101.8128 3107.1729 3136.3120 3150.8644 3163.7944 3173.9475
redmass: 5.3543 2.7872 3.9779 4.6925 1.1299 3.5341 4.5971 2.9416 4.6074 3.2177 4.1873 4.1008 7.5161 4.7764 3.7250 5.2130 5.4876 3.9700 5.2797 1.5144 2.7775 3.6117 1.5157 1.5092 1.4669 2.4533 1.3696 5.7886 1.3367 2.3644 3.2167 1.9835 1.8075 1.9246 1.1164 3.1019 2.2320 2.1234 1.3376 1.2895 2.0734 2.8733 1.2610 1.8563 2.6290 2.8394 1.0906 1.0514 1.1073 5.6707 9.5240 8.3182 6.9451 1.0359 1.0608 1.1029 1.0995 1.1009 1.0922 1.0861 1.0896 1.0945 1.1001
irintensity: 0.5478 0.7938 1.0335 0.2144 0.1413 0.8150 3.5310 1.5481 3.0936 3.4646 2.4261 4.2546 0.6724 0.6069 2.8095 0.8016 1.0956 20.7400 3.0854 86.3738 2.0309 0.0235 5.4350 0.3371 9.4721 6.5441 1.4051 26.8976 0.5975 1.2252 11.2864 8.2342 21.3492 39.1524 4.1517 12.6596 59.2426 16.8228 11.2979 21.2269 55.7253 6.4101 17.4746 36.1100 35.0420 113.6060 2.8428 1.5045 16.3531 260.8306 29.3713 253.7621 65.0998 17.3769 32.6919 3.0676 35.5029 16.3461 36.5644 3.0285 7.1407 15.1789 18.6414
temp: 298.150 k
press: 1.00000 atm
elementType: 8 7 7 6 6 6 6 6 6 6 6 6 6 1 1 1 1 1 1 1 1 1 1
symmnumber: 1
zpe: 475470.5 jmol-1
zpe.correction: 0.181097 hartree
zpe.thermalcorrener: 0.191855 hartree
zpe.thermalcorrenthalpy: 0.192799 hartree
zpe.thermalcorrgfe: 0.144366 hartree
zpe.sumelectzpe: -570.872120 hartree
zpe.sumelectthermal: -570.861362 hartree
zpe.sumelectthermalent: -570.860418 hartree
zpe.sumelectthermalfe: -570.908851 hartree
dipole: -6.1390 5.9381 -0.7239
dipole: 8.5716
quadrupole: -68.5752 -84.3231 -77.9453
quadrupole: 12.5886 0.8859 1.0663
quadrupole: 8.3727 -7.3753 -0.9974 12.5886 0.8859 1.0663
hfenergy: -571.0532168 hartree
pointgroup: C01 [X(C10H10N2O1)]
dipole: 2.0172561 2.6940232 0.2134067 debye
dipolederiv: -0.9061454 -0.5136536 -0.0693207 -0.2979368 -0.8039471 -0.043466 -0.0852527 -0.0815799 -0.3729324 -0.8891394 0.0910936 -0.0273893 -0.0901662 -1.10215 0.0332935 -0.0945451 0.0259398 -0.1550016 -1.1254199 -0.537274 -0.0887343 -0.014436 -0.5318197 0.0115226 -0.1291939 -0.0823395 -0.2804654 0.6020827 -0.3348397 0.0354256 -0.4990452 0.2551244 -0.0295506 0.0547424 -0.0368692 0.076538 0.6764274 0.2183132 -0.0328069 0.2566819 0.2397711 -0.0039123 0.0241902 0.009857 0.278101 -0.2022589 0.1205525 -0.0159482 -0.1384993 -0.5066775 -0.024741 -0.0247316 0.0014674 -0.0032421 -0.1129626 0.0797778 -0.0003154 0.3322466 -0.1244868 0.0208305 0.0184043 0.0135129 -0.1787241 0.5821462 0.4092499 0.0810371 0.4226915 1.2990613 0.0207594 0.0933169 0.073279 0.0064665 0.0265675 -0.1084537 0.0149302 0.1724352 0.1020069 0.0289561 0.0221574 -0.0132873 -0.0975246 -0.0631779 -0.0424509 0.0289636 -0.0739671 0.022127 0.0244959 0.0440076 0.0470612 -0.0736965 1.3542274 0.5500296 0.1456433 0.1525204 1.0850412 0.0418585 0.1689409 0.0979143 0.2462539 0.1754456 0.1283666 0.0418591 -0.0189544 0.1824605 0.0108477 0.0414593 0.0197909 -0.1288959 0.0103604 -0.1224402 0.0238566 -0.1968903 -0.2314265 -0.0283061 0.0172884 -0.0196268 -0.168031 0.03142 0.0039854 0.0778346 -0.0831414 -0.0520514 -0.1143501 0.0369483 -0.0790431 -0.0269459 -0.0397602 0.0223169 -0.0393884 0.1188718 -0.0130255 0.1156875 -0.018844 0.0537819 0.0389225 -0.0554193 -0.0983088 -0.0256031 -0.0823595 0.0525192 -0.0026537 -0.0333303 -0.008936 0.1519764 -0.1379551 0.0571069 -0.0352745 0.0203326 0.1042306 -0.0020783 -0.0383638 0.0063348 0.1045156 0.0415451 -0.0142816 -0.0142486 -0.0883712 0.0881862 -0.0122476 -0.0171914 -0.002486 0.1507549 0.1056214 0.0016847 0.0223732 0.0499575 -0.0437942 -0.1121692 0.0265823 -0.062411 -0.0044905 0.0296295 0.1103147 -0.0737296 0.0906553 0.0111614 0.0706272 -0.05823 0.0364768 0.0428832 -0.1328415 -0.1151446 -0.0159848 -0.1364115 0.0461614 -0.0072371 -0.0129858 -0.0054695 0.0769449 0.0945669 0.0053676 -0.0067249 0.0169149 -0.1141711 -0.0063396 -0.007356 -0.0036991 0.1535663 -0.0649601 0.0886876 -0.0264545 0.086871 0.0356985 0.0081728 -0.0280137 0.0103312 0.1630267 unknown
polarizability: 155.0069417|1.9549524|150.9379925|8.1022936|0.4248387|60.5395559 unknown
InChI: InChI=1S/C10H10N2O/c1-2-12-7-11-10(13)8-5-3-4-6-9(8)12/h3-7H,2H2,1H3
charge 0 multiplicity 1
23 atoms
O  -1.971682 -2.490235 -0.208041
N  1.421191 -0.20682 0.315868
N  0.34833 -2.380411 0.134505
C  0.198495 0.490592 0.158146
C  2.72133 0.500171 0.44822
C  -0.991384 -0.285652 -0.015371
C  0.120967 1.910758 0.178834
C  1.399476 -1.599748 0.294013
C  -2.235915 0.377312 -0.163385
C  3.27794 1.001243 -0.900806
C  -0.939014 -1.780499 -0.041704
C  -1.127113 2.541409 0.03293
C  -2.312406 1.779666 -0.140053
H  2.601397 1.332591 1.164337
H  3.431231 -0.211426 0.906025
H  1.018727 2.521238 0.308723
H  2.382661 -2.070578 0.429243
H  -3.123277 -0.25094 -0.293869
H  3.44969 0.156626 -1.590353
H  2.58574 1.706229 -1.391656
H  4.241323 1.518134 -0.741639
H  -1.179394 3.635514 0.052424
H  -3.276814 2.284726 -0.25419
