program: Orca
programVersion: 5.0.4
elementType: S S P O O O O O O C C C C C C C C C C H H H H H H H H H H H H H H H H H H H
charge: 0
multiplicity: 1
keywords: wb97x-d3
keywords: def2-TZVPP
keywords: def2/J RIJCOSX
keywords: DEFGRID2
keywords: scfconv7
keywords: smallprint printgap noloewdin
keywords: NOSOSCF
formula: C10H19O6PS2
InChI: InChI=1/C10H19O6PS2/c1-5-15-9(11)7-8(10(12)16-6-2)19-17(18,13-3)14-4/h8H,5-7H2,1-4H3
38 atoms
S  -1.490302 -1.160308 0.172336
S  -1.468139 1.89149 1.726682
P  -2.306868 0.7640 0.421144
O  0.622386 1.011177 -1.14813
O  2.943839 -0.757089 0.457187
O  -3.833021 0.344433 0.666804
O  -2.392084 1.45627 -1.010173
O  1.046353 -1.013862 -2.00622
O  3.202024 -2.801975 1.327723
C  0.309231 -0.813408 0.27093
C  1.019721 -2.10195 0.64893
C  0.726821 -0.299661 -1.090497
C  2.506227 -1.939238 0.855741
C  0.857434 1.679312 -2.399106
C  4.332075 -0.419022 0.627844
C  2.328983 1.919598 -2.639734
C  4.607795 0.102874 2.017913
C  -4.266215 -0.165671 1.931528
C  -2.960011 0.823419 -2.16208
H  0.451648 -0.051989 1.040222
H  0.605031 -2.501358 1.576297
H  0.876545 -2.874879 -0.111157
H  0.401922 1.117275 -3.215893
H  0.325171 2.624339 -2.304171
H  4.960233 -1.277203 0.386732
H  4.516057 0.352382 -0.118406
H  2.881223 0.992452 -2.789647
H  2.781542 2.467207 -1.812336
H  2.44604 2.523662 -3.540228
H  5.649946 0.418762 2.079275
H  4.446858 -0.65676 2.782643
H  3.98476 0.96735 2.248648
H  -5.35037 -0.230697 1.888042
H  -3.978605 0.50096 2.744972
H  -3.856948 -1.159378 2.118308
H  -4.042579 0.74009 -2.06926
H  -2.53126 -0.165411 -2.331228
H  -2.723599 1.459009 -3.011627
elementType: S P O C H
totalener: -1981.85648073 hartree
nucrepener: 2138.24902728 hartree
electener: -4120.10550801 hartree
oneelecener: -6982.84252882 hartree
twoeener: 2862.73702081 hartree
cpcmener: -0.03180485 hartree
kineticenergy: 1976.19397556 hartree
xcener: -133.543840381076 hartree
chargesum: 0.0000000
charge: -0.186203 -0.421841 0.654924 -0.266167 -0.265738 -0.345580 -0.329302 -0.443119 -0.456116 0.115722 -0.188497 0.333684 0.422757 0.039317 0.019568 -0.259530 -0.244917 -0.107457 -0.132427 0.119629 0.123826 0.122650 0.096053 0.107209 0.095691 0.102324 0.090234 0.090377 0.100512 0.096241 0.089656 0.089056 0.128908 0.110869 0.114075 0.138981 0.115579 0.129051
qa: -0.1862 -0.4218 0.6549 -0.2662 -0.2657 -0.3456 -0.3293 -0.4431 -0.4561 0.1157 -0.1885 0.3337 0.4228 0.0393 0.0196 -0.2595 -0.2449 -0.1075 -0.1324 0.1196 0.1238 0.1227 0.0961 0.1072 0.0957 0.1023 0.0902 0.0904 0.1005 0.0962 0.0897 0.0891 0.1289 0.1109 0.1141 0.1390 0.1156 0.1291
va: 2.2738 2.0501 5.4165 2.1418 2.1221 2.0900 2.1025 2.0587 2.0553 3.7483 3.9228 4.2112 4.1811 3.8221 3.8566 3.9418 3.9248 3.8528 3.8382 1.0659 1.0233 1.0226 1.0068 0.9973 1.0101 0.9932 1.0117 1.0027 1.0075 1.0079 1.0120 1.0035 0.9907 1.0010 0.9919 0.9949 0.9955 0.9869
dispcorr: -0.020034232 hartree
energy: -1981.876514964570
dipole: 14.06647 -14.89161 -0.82514 3.69664 -3.02245 0.67419 -5.58456 4.77900 -0.80557
magnitude: 1.33579 au
magnitude: 3.39530 debye
