program: Orca
programVersion: 5.0.4
elementType: S S P O O O O O O C C C C C C C C C C H H H H H H H H H H H H H H H H H H H
charge: 0
multiplicity: 1
keywords: wb97x-d3
keywords: def2-TZVPP
keywords: def2/J RIJCOSX
keywords: DEFGRID2
keywords: scfconv7
keywords: smallprint printgap noloewdin
keywords: NOSOSCF
formula: C10H19O6PS2
InChI: InChI=1/C10H19O6PS2/c1-5-15-9(11)7-8(10(12)16-6-2)19-17(18,13-3)14-4/h8H,5-7H2,1-4H3
38 atoms
S  -1.523913 -1.128797 0.418872
S  -1.542619 2.120287 1.468631
P  -2.3467 0.80277 0.33077
O  0.74488 0.876982 -1.192852
O  2.936263 -0.746462 0.40855
O  -3.882457 0.432927 0.585973
O  -2.364757 1.245621 -1.198277
O  0.803418 -1.258134 -1.86795
O  3.180273 -2.485909 1.793749
C  0.272629 -0.752635 0.417469
C  1.002603 -1.976214 0.949905
C  0.656649 -0.424138 -1.011109
C  2.488689 -1.77296 1.112523
C  1.009795 1.377634 -2.515386
C  4.333451 -0.405161 0.47001
C  2.484934 1.358806 -2.840604
C  4.644151 0.454557 1.67126
C  -4.382057 0.208732 1.90739
C  -2.888762 0.424267 -2.249139
H  0.42745 0.103778 1.075985
H  0.603114 -2.255874 1.925663
H  0.856966 -2.839979 0.29452
H  0.429153 0.818795 -3.250817
H  0.63296 2.398765 -2.496623
H  4.9408 -1.310471 0.453861
H  4.520661 0.139931 -0.45364
H  3.061482 1.913568 -2.099696
H  2.639013 1.840847 -3.806851
H  2.881659 0.346592 -2.910206
H  5.691731 0.755017 1.630792
H  4.488441 -0.075184 2.610778
H  4.038702 1.361285 1.677659
H  -5.463699 0.141409 1.825183
H  -4.122552 1.033536 2.571345
H  -3.996612 -0.723532 2.322448
H  -3.966689 0.298245 -2.150597
H  -2.40766 -0.554454 -2.270407
H  -2.675945 0.94208 -3.180763
elementType: S P O C H
totalener: -1981.85654562 hartree
nucrepener: 2140.85055074 hartree
electener: -4122.70709637 hartree
oneelecener: -6988.07101577 hartree
twoeener: 2865.36391940 hartree
cpcmener: -0.03190205 hartree
kineticenergy: 1976.19729130 hartree
xcener: -133.544087642439 hartree
chargesum: -0.0000000
charge: -0.178687 -0.421052 0.649737 -0.262341 -0.261190 -0.346428 -0.329333 -0.444045 -0.454374 0.090336 -0.168142 0.336740 0.412475 0.044312 0.014146 -0.269828 -0.244035 -0.105649 -0.130663 0.116880 0.120190 0.125159 0.093249 0.110079 0.099040 0.101385 0.090915 0.104021 0.093053 0.097241 0.089637 0.089181 0.128915 0.110875 0.114600 0.140036 0.113328 0.130237
qa: -0.1787 -0.4211 0.6497 -0.2623 -0.2612 -0.3464 -0.3293 -0.4440 -0.4544 0.0903 -0.1681 0.3367 0.4125 0.0443 0.0141 -0.2698 -0.2440 -0.1056 -0.1307 0.1169 0.1202 0.1252 0.0932 0.1101 0.0990 0.1014 0.0909 0.1040 0.0931 0.0972 0.0896 0.0892 0.1289 0.1109 0.1146 0.1400 0.1133 0.1302
va: 2.2774 2.0524 5.4254 2.1391 2.1247 2.0924 2.1004 2.0552 2.0554 3.7887 3.9122 4.1955 4.1899 3.8233 3.8556 3.9381 3.9211 3.8501 3.8331 1.0642 1.0258 1.0213 1.0082 0.9962 1.0105 0.9932 1.0009 1.0083 1.0099 1.0075 1.0129 1.0040 0.9906 1.0018 0.9909 0.9948 0.9969 0.9878
dispcorr: -0.020366031 hartree
energy: -1981.876911655055
dipole: 15.03828 -15.64978 -0.61150 2.67760 -2.19839 0.47921 -7.03298 6.04567 -0.98732
magnitude: 1.25633 au
magnitude: 3.19335 debye
