program: Orca
programVersion: 5.0.4
elementType: S S P O O O O O O C C C C C C C C C C H H H H H H H H H H H H H H H H H H H
charge: 0
multiplicity: 1
keywords: wb97x-d3
keywords: def2-TZVPP
keywords: def2/J RIJCOSX
keywords: DEFGRID2
keywords: scfconv7
keywords: smallprint printgap noloewdin
keywords: NOSOSCF
formula: C10H19O6PS2
InChI: InChI=1/C10H19O6PS2/c1-5-15-9(11)7-8(10(12)16-6-2)19-17(18,13-3)14-4/h8H,5-7H2,1-4H3
38 atoms
S  -0.634448 -0.004226 -0.760639
S  -2.939772 -0.253514 1.739089
P  -2.498396 -0.70345 -0.077525
O  1.003788 2.258776 -0.730136
O  2.469633 -0.554919 -0.046976
O  -2.528072 -2.246039 -0.484095
O  -3.493112 -0.205167 -1.224528
O  1.797677 2.220196 1.36108
O  1.901045 -2.49095 0.922524
C  0.124216 0.63859 0.771249
C  0.781053 -0.472345 1.578796
C  1.087058 1.783065 0.499472
C  1.762172 -1.305819 0.793046
C  1.867746 3.3441 -1.085428
C  3.45381 -1.193426 -0.86643
C  3.266855 2.871446 -1.416493
C  4.752795 -1.421426 -0.124597
C  -1.798743 -3.193919 0.286215
C  -3.832895 1.171192 -1.308257
H  -0.687683 1.054021 1.378773
H  1.304163 -0.032097 2.433104
H  0.014199 -1.128833 1.987885
H  1.395707 3.792583 -1.958487
H  1.884883 4.088228 -0.28754
H  3.058903 -2.129067 -1.264754
H  3.601711 -0.50721 -1.699432
H  3.76389 2.4452 -0.547181
H  3.862765 3.717195 -1.760396
H  3.252355 2.128033 -2.213356
H  5.500038 -1.814657 -0.814527
H  4.634739 -2.141496 0.682947
H  5.139336 -0.490733 0.289939
H  -2.023623 -4.171615 -0.131642
H  -2.103983 -3.170534 1.333154
H  -0.723386 -3.020239 0.219916
H  -2.950003 1.784615 -1.499902
H  -4.318053 1.514776 -0.393876
H  -4.522345 1.271282 -2.142155
totalener: -1981.83410392 hartree
nucrepener: 2147.17841164 hartree
electener: -4129.01251556 hartree
oneelecener: -7000.10375619 hartree
twoeener: 2871.09124063 hartree
kineticenergy: 1976.27383568 hartree
xcener: -133.555618079701 hartree
chargesum: -0.0000000
charge: -0.155511 -0.390765 0.623099 -0.255841 -0.255249 -0.295135 -0.304607 -0.363280 -0.363873 0.080885 -0.168856 0.312319 0.326038 0.021725 0.006157 -0.264292 -0.241433 -0.132708 -0.127096 0.112216 0.118575 0.109418 0.099041 0.092365 0.098185 0.087893 0.103063 0.094429 0.080858 0.083571 0.101036 0.085721 0.120015 0.114887 0.111371 0.101925 0.114467 0.119386
qa: -0.1555 -0.3908 0.6231 -0.2558 -0.2552 -0.2951 -0.3046 -0.3633 -0.3639 0.0809 -0.1689 0.3123 0.3260 0.0217 0.0062 -0.2643 -0.2414 -0.1327 -0.1271 0.1122 0.1186 0.1094 0.0990 0.0924 0.0982 0.0879 0.1031 0.0944 0.0809 0.0836 0.1010 0.0857 0.1200 0.1149 0.1114 0.1019 0.1145 0.1194
va: 2.3449 2.0662 5.4131 2.1450 2.1058 2.1345 2.1340 2.1397 2.1249 3.8590 3.8717 4.2787 4.1769 3.8833 3.8803 3.9098 3.9102 3.8638 3.8744 1.0611 1.0277 1.0380 0.9950 1.0095 1.0129 0.9939 1.0114 1.0124 1.0035 1.0100 1.0133 1.0041 0.9966 1.0001 0.9974 0.9955 0.9988 0.9932
dispcorr: -0.020239545 hartree
energy: -1981.854343464432
dipole: 21.99689 -21.23821 0.75868 4.45754 -3.67091 0.78663 -6.40739 5.13039 -1.27699
magnitude: 1.68080 au
magnitude: 4.27226 debye
