program: Orca
programVersion: 5.0.4
elementType: S S P O O O O O O C C C C C C C C C C H H H H H H H H H H H H H H H H H H H
charge: 0
multiplicity: 1
keywords: wb97x-d3
keywords: def2-TZVPP
keywords: def2/J RIJCOSX
keywords: DEFGRID2
keywords: scfconv7
keywords: smallprint printgap noloewdin
keywords: NOSOSCF
formula: C10H19O6PS2
InChI: InChI=1/C10H19O6PS2/c1-5-15-9(11)7-8(10(12)16-6-2)19-17(18,13-3)14-4/h8H,5-7H2,1-4H3
38 atoms
S  -0.296214 0.194206 -0.890955
S  -3.100878 0.048144 1.060031
P  -1.985888 -0.833145 -0.238067
O  1.536437 2.226913 -0.866937
O  2.4523 -0.529504 0.566092
O  -1.382647 -2.25158 0.170205
O  -2.668552 -1.178515 -1.649732
O  1.879038 2.567759 1.318179
O  1.523759 -2.133355 1.825997
C  0.186199 1.024194 0.668067
C  0.542076 0.053673 1.788457
C  1.309533 2.018111 0.418035
C  1.536941 -1.011669 1.403572
C  2.555631 3.167205 -1.226638
C  3.421397 -1.43243 0.027864
C  2.063384 4.596684 -1.164576
C  2.870302 -2.209496 -1.148929
C  -2.031509 -3.155464 1.059059
C  -3.454532 -0.19494 -2.312068
H  -0.681079 1.607271 0.996332
H  0.954016 0.62788 2.623883
H  -0.356389 -0.429895 2.16728
H  3.432039 3.025977 -0.592184
H  2.826103 2.895894 -2.246171
H  4.249558 -0.795594 -0.281551
H  3.784068 -2.103895 0.807381
H  2.841396 5.263013 -1.538393
H  1.829742 4.899421 -0.145648
H  1.178739 4.738173 -1.784902
H  2.496752 -1.540168 -1.92298
H  2.059705 -2.871578 -0.849259
H  3.661821 -2.821736 -1.582738
H  -1.250421 -3.767958 1.501841
H  -2.732034 -3.788639 0.513751
H  -2.565497 -2.624478 1.848086
H  -2.85427 0.67656 -2.581923
H  -4.288473 0.128913 -1.688083
H  -3.836937 -0.657406 -3.218537
totalener: -1981.83272686 hartree
nucrepener: 2166.65431787 hartree
electener: -4148.48704472 hartree
oneelecener: -7039.52283126 hartree
twoeener: 2891.03578653 hartree
kineticenergy: 1976.27686636 hartree
xcener: -133.555725585598 hartree
chargesum: 0.0000000
charge: -0.140937 -0.403892 0.621518 -0.262055 -0.256208 -0.297050 -0.327713 -0.362292 -0.360292 0.067583 -0.156373 0.321531 0.324856 0.018385 0.004481 -0.250575 -0.242375 -0.123099 -0.121334 0.119995 0.120302 0.107297 0.090238 0.098355 0.089711 0.094266 0.084165 0.101216 0.086254 0.082182 0.100173 0.087419 0.125869 0.119585 0.105283 0.102594 0.113348 0.117589
qa: -0.1409 -0.4039 0.6215 -0.2621 -0.2562 -0.2970 -0.3277 -0.3623 -0.3603 0.0676 -0.1564 0.3215 0.3249 0.0184 0.0045 -0.2506 -0.2424 -0.1231 -0.1213 0.1200 0.1203 0.1073 0.0902 0.0984 0.0897 0.0943 0.0842 0.1012 0.0863 0.0822 0.1002 0.0874 0.1259 0.1196 0.1053 0.1026 0.1133 0.1176
va: 2.3458 2.0484 5.4247 2.1365 2.1144 2.1143 2.1129 2.1403 2.1330 3.9242 3.8213 4.2719 4.2067 3.8868 3.8878 3.9191 3.9037 3.8503 3.8738 1.0369 1.0269 1.0448 1.0098 0.9947 0.9958 1.0113 1.0097 1.0124 1.0051 1.0077 1.0151 1.0123 0.9893 0.9910 1.0098 0.9945 1.0034 0.9915
dispcorr: -0.020067189 hartree
energy: -1981.852794044684
dipole: 11.90644 -11.52405 0.38239 3.13168 -2.88111 0.25058 -7.55978 6.14330 -1.41648
magnitude: 1.48843 au
magnitude: 3.78329 debye
