program: Orca
programVersion: 5.0.4
elementType: S S P O O O O O O C C C C C C C C C C H H H H H H H H H H H H H H H H H H H
charge: 0
multiplicity: 1
keywords: wb97x-d3
keywords: def2-TZVPP
keywords: def2/J RIJCOSX
keywords: DEFGRID2
keywords: scfconv7
keywords: smallprint printgap noloewdin
keywords: NOSOSCF
formula: C10H19O6PS2
InChI: InChI=1/C10H19O6PS2/c1-5-15-9(11)7-8(10(12)16-6-2)19-17(18,13-3)14-4/h8H,5-7H2,1-4H3
38 atoms
S  -0.629679 -0.832653 -0.299333
S  -2.406078 1.94012 0.67292
P  -2.468458 0.151782 -0.005405
O  0.584642 1.595478 -1.262634
O  3.273409 -2.141153 1.261161
O  -3.372387 -0.816728 0.888754
O  -3.143599 -0.072843 -1.447123
O  2.323278 1.675383 0.144022
O  2.306291 -1.455348 -0.636168
C  0.515715 0.212787 0.658038
C  1.477671 -0.645153 1.459685
C  1.261924 1.225904 -0.19332
C  2.386987 -1.446096 0.562143
C  1.092727 2.68639 -2.035272
C  4.212034 -2.937712 0.529952
C  0.716938 4.019798 -1.425153
C  5.074391 -3.668355 1.530845
C  -3.549851 -2.193895 0.583174
C  -2.692413 0.683057 -2.563977
H  -0.092882 0.800831 1.354257
H  2.082816 -0.010968 2.110492
H  0.921999 -1.320179 2.11399
H  2.173012 2.593553 -2.156848
H  0.630599 2.566215 -3.014689
H  3.679772 -3.638607 -0.11673
H  4.8152 -2.293649 -0.113799
H  -0.359721 4.090595 -1.272938
H  1.020352 4.826482 -2.093336
H  1.212442 4.177842 -0.468619
H  5.621652 -2.97615 2.169938
H  5.803656 -4.282518 1.002947
H  4.48162 -4.326239 2.165699
H  -4.09875 -2.329929 -0.348793
H  -4.125005 -2.622862 1.399874
H  -2.592088 -2.714766 0.516587
H  -1.645479 0.469615 -2.787157
H  -2.80858 1.752425 -2.382779
H  -3.307442 0.390757 -3.411515
totalener: -1981.83343958 hartree
nucrepener: 2112.35989831 hartree
electener: -4094.19333789 hartree
oneelecener: -6931.21565912 hartree
twoeener: 2837.02232123 hartree
kineticenergy: 1976.26794402 hartree
xcener: -133.553662089894 hartree
chargesum: 0.0000000
charge: -0.176353 -0.377791 0.641760 -0.251661 -0.271538 -0.302907 -0.325506 -0.373221 -0.363480 0.104033 -0.181620 0.315164 0.364002 0.015708 0.030994 -0.239657 -0.228278 -0.136891 -0.120530 0.098451 0.116858 0.114580 0.097518 0.087705 0.086921 0.090320 0.083545 0.084862 0.098389 0.086218 0.078374 0.082150 0.119024 0.118721 0.099614 0.106351 0.108333 0.119838
qa: -0.1764 -0.3778 0.6418 -0.2517 -0.2715 -0.3029 -0.3255 -0.3732 -0.3635 0.1040 -0.1816 0.3152 0.3640 0.0157 0.0310 -0.2397 -0.2283 -0.1369 -0.1205 0.0985 0.1169 0.1146 0.0975 0.0877 0.0869 0.0903 0.0835 0.0849 0.0984 0.0862 0.0784 0.0822 0.1190 0.1187 0.0996 0.1064 0.1083 0.1198
va: 2.2915 2.0832 5.3921 2.1454 2.1542 2.1447 2.0886 2.1328 2.1210 3.8432 3.9386 4.2535 4.1558 3.8809 3.8776 3.9094 3.9566 3.8870 3.8807 1.0697 1.0280 1.0253 1.0137 0.9940 0.9982 0.9976 1.0118 1.0108 1.0120 1.0053 1.0085 1.0057 0.9906 0.9898 1.0001 0.9931 1.0010 0.9927
dispcorr: -0.018399507 hartree
energy: -1981.851839086717
dipole: 15.04263 -14.72001 0.32261 -4.27632 3.14121 -1.13511 -3.94008 3.44389 -0.49618
magnitude: 1.28014 au
magnitude: 3.25386 debye
