program: Orca
programVersion: 5.0.4
elementType: S S P O O O O O O C C C C C C C C C C H H H H H H H H H H H H H H H H H H H
charge: 0
multiplicity: 1
keywords: wb97x-d3
keywords: def2-TZVPP
keywords: def2/J RIJCOSX
keywords: DEFGRID2
keywords: scfconv7
keywords: smallprint printgap noloewdin
keywords: NOSOSCF
formula: C10H19O6PS2
InChI: InChI=1/C10H19O6PS2/c1-5-15-9(11)7-8(10(12)16-6-2)19-17(18,13-3)14-4/h8H,5-7H2,1-4H3
38 atoms
S  -1.27223 -0.60118 -1.266735
S  -1.989734 -0.41904 2.081085
P  -2.501279 0.048584 0.290817
O  0.416337 1.713602 0.06747
O  2.842313 -1.039289 0.474699
O  -3.905659 -0.542399 -0.223291
O  -2.708959 1.600358 -0.029035
O  1.804078 1.061218 -1.568496
O  3.538006 -2.2697 -1.261926
C  0.391103 -0.553746 -0.495836
C  1.232376 -1.642489 -1.139917
C  0.973409 0.822216 -0.736988
C  2.671258 -1.687948 -0.674834
C  0.793044 3.084928 -0.080275
C  4.161264 -0.98494 1.026695
C  2.082363 3.401677 0.64583
C  4.516187 -2.240087 1.794751
C  -4.242422 -1.90012 0.032932
C  -3.304398 2.454724 0.942649
H  0.25817 -0.730395 0.574587
H  0.784653 -2.616238 -0.924125
H  1.250691 -1.543243 -2.225577
H  0.866211 3.343013 -1.137953
H  -0.038707 3.643847 0.346813
H  4.888361 -0.79097 0.236727
H  4.143142 -0.121012 1.690217
H  2.018574 3.132164 1.699756
H  2.278726 4.472654 0.586064
H  2.930365 2.883416 0.201602
H  5.484038 -2.105881 2.278872
H  4.59042 -3.106009 1.139658
H  3.782257 -2.449365 2.572808
H  -3.538848 -2.581861 -0.449375
H  -5.233633 -2.061006 -0.38347
H  -4.258111 -2.107153 1.103574
H  -3.268895 3.46077 0.532184
H  -2.754595 2.423711 1.883807
H  -4.344868 2.184144 1.127979
totalener: -1981.83424713 hartree
nucrepener: 2119.04594720 hartree
electener: -4100.88019433 hartree
oneelecener: -6944.07513703 hartree
twoeener: 2843.19494270 hartree
kineticenergy: 1976.26459504 hartree
xcener: -133.549350407524 hartree
chargesum: -0.0000000
charge: -0.152001 -0.396681 0.635550 -0.258837 -0.278697 -0.326400 -0.305917 -0.358566 -0.355879 0.117671 -0.229690 0.304252 0.383226 0.030048 0.017862 -0.250827 -0.247824 -0.120283 -0.146043 0.123257 0.107908 0.118060 0.092318 0.086135 0.093318 0.089922 0.086429 0.085084 0.097031 0.082258 0.100914 0.084089 0.101262 0.118375 0.113311 0.117689 0.116296 0.125381
qa: -0.1520 -0.3967 0.6356 -0.2588 -0.2787 -0.3264 -0.3059 -0.3586 -0.3559 0.1177 -0.2297 0.3043 0.3832 0.0300 0.0179 -0.2508 -0.2478 -0.1203 -0.1460 0.1233 0.1079 0.1181 0.0923 0.0861 0.0933 0.0899 0.0864 0.0851 0.0970 0.0823 0.1009 0.0841 0.1013 0.1184 0.1133 0.1177 0.1163 0.1254
va: 2.3071 2.0607 5.4114 2.1524 2.1033 2.1042 2.1087 2.1409 2.1535 3.7216 3.9459 4.2354 4.1842 3.8901 3.8880 3.9172 3.9199 3.8749 3.8722 1.0729 1.0197 1.0234 1.0095 0.9921 1.0090 0.9948 1.0045 1.0102 1.0129 1.0105 1.0130 1.0043 0.9959 0.9918 1.0030 0.9889 0.9998 0.9918
dispcorr: -0.018788344 hartree
energy: -1981.853035470808
dipole: 13.07588 -13.91671 -0.84083 5.42577 -4.67237 0.75340 8.77331 -7.81515 0.95815
magnitude: 1.48077 au
magnitude: 3.76381 debye
