program: Orca
programVersion: 5.0.4
elementType: S S P O O O O O O C C C C C C C C C C H H H H H H H H H H H H H H H H H H H
charge: 0
multiplicity: 1
keywords: wb97x-d3
keywords: def2-TZVPP
keywords: def2/J RIJCOSX
keywords: DEFGRID2
keywords: scfconv7
keywords: smallprint printgap noloewdin
keywords: NOSOSCF
formula: C10H19O6PS2
InChI: InChI=1/C10H19O6PS2/c1-5-15-9(11)7-8(10(12)16-6-2)19-17(18,13-3)14-4/h8H,5-7H2,1-4H3
38 atoms
S  -0.448777 -0.159133 1.268117
S  -0.975437 0.620734 -2.04642
P  -1.714661 0.006107 -0.379999
O  -0.00617 2.621499 0.462618
O  2.306947 -2.742089 -0.10546
O  -2.923349 0.84898 0.240347
O  -2.391662 -1.4528 -0.432697
O  1.869834 2.341469 -0.722444
O  2.492771 -1.641126 1.834843
C  1.126748 0.561206 0.684947
C  1.919009 -0.426627 -0.152141
C  1.033409 1.931273 0.031449
C  2.264553 -1.652345 0.655721
C  -0.234041 3.902578 -0.131611
C  2.686283 -3.975641 0.514191
C  -1.471252 4.485567 0.506222
C  4.18598 -4.101719 0.676547
C  -4.004342 1.254171 -0.595193
C  -1.678123 -2.530225 -1.021695
H  1.657285 0.714839 1.632238
H  1.38116 -0.684029 -1.0638
H  2.856935 0.039991 -0.468156
H  0.633962 4.54678 0.025358
H  -0.364798 3.776053 -1.208884
H  2.180489 -4.084499 1.474977
H  2.308021 -4.74555 -0.15753
H  -1.338192 4.632638 1.577555
H  -2.334776 3.838862 0.355913
H  -1.690881 5.454721 0.058907
H  4.426145 -5.092745 1.062842
H  4.578629 -3.368823 1.378863
H  4.699426 -3.983887 -0.27752
H  -4.607305 0.39984 -0.904246
H  -3.642429 1.777251 -1.481628
H  -4.618255 1.928486 -0.003873
H  -1.486602 -2.344261 -2.079352
H  -2.298939 -3.41633 -0.914815
H  -0.725067 -2.701729 -0.514461
totalener: -1981.83355902 hartree
nucrepener: 2156.42571338 hartree
electener: -4138.25927240 hartree
oneelecener: -7019.05943735 hartree
twoeener: 2880.80016495 hartree
kineticenergy: 1976.27643134 hartree
xcener: -133.553969288772 hartree
chargesum: -0.0000000
charge: -0.116990 -0.398730 0.655801 -0.250701 -0.270284 -0.314970 -0.324621 -0.344809 -0.372020 0.098153 -0.171871 0.267662 0.336980 0.005099 0.031194 -0.218635 -0.252756 -0.161663 -0.119856 0.110765 0.111106 0.115004 0.098304 0.098373 0.090651 0.096306 0.085358 0.078202 0.080298 0.083730 0.100842 0.085524 0.131001 0.114064 0.121946 0.117454 0.118663 0.085429
qa: -0.1170 -0.3987 0.6558 -0.2507 -0.2703 -0.3150 -0.3246 -0.3448 -0.3720 0.0982 -0.1719 0.2677 0.3370 0.0051 0.0312 -0.2186 -0.2528 -0.1617 -0.1199 0.1108 0.1111 0.1150 0.0983 0.0984 0.0907 0.0963 0.0854 0.0782 0.0803 0.0837 0.1008 0.0855 0.1310 0.1141 0.1219 0.1175 0.1187 0.0854
va: 2.3214 2.0436 5.3651 2.1254 2.1243 2.1168 2.1043 2.1513 2.1185 3.8270 3.9070 4.2966 4.1745 3.8794 3.8663 3.9527 3.9288 3.8723 3.8954 1.0378 1.0440 1.0326 1.0035 1.0033 1.0102 0.9942 1.0071 1.0028 1.0091 1.0095 1.0119 1.0047 0.9954 0.9997 0.9858 1.0007 0.9938 0.9966
dispcorr: -0.020135189 hartree
energy: -1981.853694207701
dipole: 3.39404 -4.14865 -0.75461 -3.36488 2.78186 -0.58302 -0.83967 0.72906 -0.11061
magnitude: 0.95999 au
magnitude: 2.44010 debye
