program: Orca
programVersion: 5.0.4
elementType: S S P O O O O O O C C C C C C C C C C H H H H H H H H H H H H H H H H H H H
charge: 0
multiplicity: 1
keywords: wb97x-d3
keywords: def2-TZVPP
keywords: def2/J RIJCOSX
keywords: DEFGRID2
keywords: scfconv7
keywords: smallprint printgap noloewdin
keywords: NOSOSCF
formula: C10H19O6PS2
InChI: InChI=1/C10H19O6PS2/c1-5-15-9(11)7-8(10(12)16-6-2)19-17(18,13-3)14-4/h8H,5-7H2,1-4H3
38 atoms
S  -1.413094 -1.212518 0.227362
S  -1.57847 2.105898 1.063602
P  -2.321967 0.658076 0.046513
O  0.601896 0.554069 -1.427894
O  2.847259 -0.389632 1.316243
O  -3.837195 0.252841 0.3956
O  -2.437587 0.850232 -1.535854
O  1.701918 -1.39982 -1.38564
O  3.222913 -2.516558 1.908412
C  0.343761 -0.753969 0.486392
C  1.00555 -1.861066 1.288233
C  0.98182 -0.587166 -0.876082
C  2.484826 -1.652797 1.530121
C  1.004992 0.829245 -2.770839
C  4.234323 -0.058284 1.428811
C  2.398656 1.414303 -2.840059
C  5.003429 -0.424987 0.178043
C  -4.26502 0.171264 1.748582
C  -2.862855 2.100427 -2.069749
H  0.352331 0.19413 1.029555
H  0.517463 -1.944383 2.262843
H  0.893408 -2.830138 0.800762
H  0.927184 -0.073443 -3.379008
H  0.268753 1.544987 -3.134321
H  4.246919 1.0194 1.589147
H  4.66536 -0.538051 2.308951
H  2.6170 1.713881 -3.865646
H  3.153274 0.689432 -2.539312
H  2.487265 2.297452 -2.207476
H  4.570661 0.046117 -0.703971
H  5.023846 -1.501572 0.018802
H  6.033562 -0.079572 0.271517
H  -3.734865 -0.618504 2.284693
H  -5.326062 -0.06485 1.727888
H  -4.111655 1.117488 2.268464
H  -2.775234 2.0216 -3.150577
H  -2.23435 2.916327 -1.710864
H  -3.902234 2.310034 -1.81304
totalener: -1981.83376445 hartree
nucrepener: 2136.67671936 hartree
electener: -4118.51048381 hartree
oneelecener: -6979.32557286 hartree
twoeener: 2860.81508906 hartree
kineticenergy: 1976.27692575 hartree
xcener: -133.552593378098 hartree
chargesum: -0.0000000
charge: -0.152713 -0.394554 0.636563 -0.258764 -0.276573 -0.328202 -0.306996 -0.359067 -0.353572 0.119154 -0.222924 0.303609 0.370169 0.035922 0.003198 -0.263561 -0.242544 -0.120017 -0.150856 0.123613 0.108084 0.116662 0.092864 0.084938 0.097874 0.094431 0.089349 0.098460 0.091354 0.075249 0.106152 0.088051 0.101402 0.117833 0.113322 0.118284 0.117018 0.126788
qa: -0.1527 -0.3946 0.6366 -0.2588 -0.2766 -0.3282 -0.3070 -0.3591 -0.3536 0.1192 -0.2229 0.3036 0.3702 0.0359 0.0032 -0.2636 -0.2425 -0.1200 -0.1509 0.1236 0.1081 0.1167 0.0929 0.0849 0.0979 0.0944 0.0893 0.0985 0.0914 0.0752 0.1062 0.0881 0.1014 0.1178 0.1133 0.1183 0.1170 0.1268
va: 2.3066 2.0627 5.4107 2.1471 2.1033 2.1040 2.1046 2.1379 2.1566 3.7264 3.9335 4.2277 4.2097 3.8825 3.8921 3.9192 3.9148 3.8753 3.8714 1.0721 1.0195 1.0252 1.0089 0.9919 0.9941 1.0110 1.0105 1.0077 1.0043 1.0042 1.0126 1.0111 0.9954 0.9917 1.0038 0.9878 0.9992 0.9930
dispcorr: -0.019843335 hartree
energy: -1981.853607781216
dipole: 14.83457 -15.53450 -0.69994 6.79998 -5.56592 1.23406 -7.55979 7.00867 -0.55113
magnitude: 1.52202 au
magnitude: 3.86867 debye
