program: Orca
programVersion: 5.0.4
elementType: S S P O O O O O O C C C C C C C C C C H H H H H H H H H H H H H H H H H H H
charge: 0
multiplicity: 1
keywords: wb97x-d3
keywords: def2-TZVPP
keywords: def2/J RIJCOSX
keywords: DEFGRID2
keywords: scfconv7
keywords: smallprint printgap noloewdin
keywords: NOSOSCF
formula: C10H19O6PS2
InChI: InChI=1/C10H19O6PS2/c1-5-15-9(11)7-8(10(12)16-6-2)19-17(18,13-3)14-4/h8H,5-7H2,1-4H3
38 atoms
S  -0.868325 -0.362588 -1.323916
S  -2.306944 -0.509252 1.791918
P  -2.435566 0.10091 -0.021407
O  0.31379 1.801424 0.578934
O  3.876648 -1.889799 -0.58612
O  -3.665264 -0.480886 -0.880405
O  -2.648917 1.666995 -0.258057
O  2.166323 1.379448 -0.609954
O  2.841862 -1.107204 1.240937
C  0.584704 -0.381541 -0.210681
C  1.612082 -1.327328 -0.805811
C  1.134537 1.026934 -0.109717
C  2.833903 -1.408888 0.079209
C  0.625984 3.192363 0.690981
C  5.1077 -2.049846 0.125111
C  0.271241 3.964995 -0.561628
C  5.147892 -3.338859 0.917632
C  -3.968551 -1.868719 -0.833796
C  -3.450004 2.427741 0.639614
H  0.251335 -0.727445 0.771825
H  1.180794 -2.328975 -0.887608
H  1.902764 -1.024479 -1.812308
H  0.032194 3.534638 1.537428
H  1.679636 3.319251 0.94484
H  5.873158 -2.051227 -0.649778
H  5.282287 -1.188284 0.770822
H  0.418817 5.030633 -0.382984
H  -0.770221 3.808293 -0.839286
H  0.899917 3.679372 -1.402634
H  4.964159 -4.202697 0.279303
H  4.418554 -3.338214 1.725298
H  6.135989 -3.45938 1.362765
H  -4.848874 -2.018621 -1.453793
H  -4.18057 -2.192089 0.185825
H  -3.146875 -2.467704 -1.231734
H  -3.113541 2.305945 1.669424
H  -4.501329 2.144992 0.571339
H  -3.343444 3.468421 0.343283
totalener: -1981.83571351 hartree
nucrepener: 2104.40508324 hartree
electener: -4086.24079676 hartree
oneelecener: -6915.20835100 hartree
twoeener: 2828.96755425 hartree
kineticenergy: 1976.26875715 hartree
xcener: -133.551488533224 hartree
chargesum: 0.0000000
charge: -0.156199 -0.386953 0.633624 -0.260724 -0.273076 -0.325500 -0.309988 -0.363091 -0.372052 0.076616 -0.202399 0.331194 0.368684 0.005032 0.033370 -0.249950 -0.254954 -0.120097 -0.136899 0.130072 0.110849 0.115229 0.098126 0.103484 0.096841 0.089525 0.086426 0.082087 0.102911 0.082429 0.100331 0.083096 0.117226 0.113124 0.099211 0.116967 0.127742 0.107681
qa: -0.1562 -0.3870 0.6336 -0.2607 -0.2731 -0.3255 -0.3100 -0.3631 -0.3721 0.0766 -0.2024 0.3312 0.3687 0.0050 0.0334 -0.2499 -0.2550 -0.1201 -0.1369 0.1301 0.1108 0.1152 0.0981 0.1035 0.0968 0.0895 0.0864 0.0821 0.1029 0.0824 0.1003 0.0831 0.1172 0.1131 0.0992 0.1170 0.1277 0.1077
va: 2.3098 2.0697 5.4124 2.1472 2.1481 2.1035 2.1087 2.1354 2.1237 3.8253 3.9337 4.2213 4.1996 3.8732 3.8803 3.9081 3.9127 3.8766 3.8731 1.0625 1.0208 1.0262 0.9954 1.0100 0.9952 1.0114 1.0088 1.0080 1.0126 1.0053 1.0112 1.0103 0.9919 1.0038 0.9964 1.0007 0.9928 0.9873
dispcorr: -0.018814556 hartree
energy: -1981.854528070456
dipole: 11.03375 -11.42164 -0.38789 1.99060 -1.97888 0.01172 1.05842 -1.48277 -0.42435
magnitude: 0.57504 au
magnitude: 1.46163 debye
