program: Orca
programVersion: 5.0.4
elementType: S S P O O O O O O C C C C C C C C C C H H H H H H H H H H H H H H H H H H H
charge: 0
multiplicity: 1
keywords: wb97x-d3
keywords: def2-TZVPP
keywords: def2/J RIJCOSX
keywords: DEFGRID2
keywords: scfconv7
keywords: smallprint printgap noloewdin
keywords: NOSOSCF
formula: C10H19O6PS2
InChI: InChI=1/C10H19O6PS2/c1-5-15-9(11)7-8(10(12)16-6-2)19-17(18,13-3)14-4/h8H,5-7H2,1-4H3
38 atoms
S  -0.084287 -0.283995 -1.108378
S  -2.069634 0.420815 1.609282
P  -1.974213 -0.09603 -0.240186
O  -0.107112 2.491198 -0.339861
O  3.47663 -2.210943 0.120236
O  -2.631868 -1.518585 -0.596372
O  -2.720561 0.838949 -1.300301
O  2.016875 2.627016 0.353814
O  1.481749 -2.13813 1.12472
C  0.983785 0.473362 0.157418
C  2.361676 -0.158261 0.070765
C  1.045713 1.986393 0.055583
C  2.355913 -1.605979 0.498396
C  -0.298023 3.906862 -0.28309
C  3.642671 -3.58212 0.492911
C  -0.689366 4.35189 1.109192
C  4.976337 -4.045164 -0.042254
C  -2.294212 -2.649533 0.201263
C  -4.046126 1.289179 -1.039892
H  0.535233 0.240711 1.130845
H  2.78908 -0.06321 -0.929562
H  3.041087 0.387088 0.732166
H  0.59783 4.424282 -0.629663
H  -1.100442 4.101694 -0.993112
H  3.598889 -3.679403 1.580125
H  2.825254 -4.178021 0.080457
H  0.12519 4.21344 1.818652
H  -1.556581 3.796977 1.465829
H  -0.942369 5.412507 1.09707
H  5.798479 -3.46456 0.375151
H  5.020048 -3.969801 -1.12834
H  5.134329 -5.089296 0.226836
H  -1.213451 -2.800214 0.242466
H  -2.760504 -3.512386 -0.267865
H  -2.672546 -2.536069 1.217612
H  -4.111197 1.782968 -0.06922
H  -4.759523 0.464506 -1.069979
H  -4.29305 2.000507 -1.824149
totalener: -1981.83397442 hartree
nucrepener: 2117.49823611 hartree
electener: -4099.33221053 hartree
oneelecener: -6941.59225902 hartree
twoeener: 2842.26004849 hartree
kineticenergy: 1976.28378133 hartree
xcener: -133.554011312632 hartree
chargesum: 0.0000000
charge: -0.146411 -0.406240 0.661360 -0.246909 -0.265078 -0.329330 -0.311665 -0.365602 -0.366566 0.054093 -0.161337 0.326717 0.349416 0.009499 0.030548 -0.241906 -0.229266 -0.117172 -0.138901 0.108562 0.110052 0.115452 0.096566 0.098029 0.088606 0.086112 0.096392 0.084806 0.084923 0.084778 0.084317 0.078253 0.108489 0.112454 0.112743 0.106372 0.120962 0.116885
qa: -0.1464 -0.4062 0.6614 -0.2469 -0.2651 -0.3293 -0.3117 -0.3656 -0.3666 0.0541 -0.1613 0.3267 0.3494 0.0095 0.0305 -0.2419 -0.2293 -0.1172 -0.1389 0.1086 0.1101 0.1155 0.0966 0.0980 0.0886 0.0861 0.0964 0.0848 0.0849 0.0848 0.0843 0.0783 0.1085 0.1125 0.1127 0.1064 0.1210 0.1169
va: 2.3007 2.0430 5.3838 2.1403 2.1411 2.1034 2.1218 2.1313 2.1164 3.8238 3.9214 4.2519 4.1615 3.8787 3.8806 3.9179 3.9582 3.8794 3.8821 1.0660 1.0238 1.0303 1.0118 0.9931 0.9980 0.9974 1.0108 1.0132 1.0108 1.0056 1.0054 1.0086 0.9941 0.9909 1.0030 1.0022 0.9925 0.9888
dispcorr: -0.018617110 hartree
energy: -1981.852591532415
dipole: 7.69959 -7.76438 -0.06480 -2.23021 1.85487 -0.37535 2.22771 -2.80673 -0.57902
magnitude: 0.69307 au
magnitude: 1.76165 debye
