program: Orca
programVersion: 5.0.4
elementType: S S P O O O O O O C C C C C C C C C C H H H H H H H H H H H H H H H H H H H
charge: 0
multiplicity: 1
keywords: wb97x-d3
keywords: def2-TZVPP
keywords: def2/J RIJCOSX
keywords: DEFGRID2
keywords: scfconv7
keywords: smallprint printgap noloewdin
keywords: NOSOSCF
formula: C10H19O6PS2
InChI: InChI=1/C10H19O6PS2/c1-5-15-9(11)7-8(10(12)16-6-2)19-17(18,13-3)14-4/h8H,5-7H2,1-4H3
38 atoms
S  0.146667 0.271357 -1.113163
S  -1.454724 -1.30439 1.466704
P  -1.615902 -0.387022 -0.213745
O  -0.234036 2.302011 1.156187
O  2.524164 -1.815822 0.775532
O  -2.23984 -1.22492 -1.434539
O  -2.563404 0.899556 -0.247095
O  1.809815 2.990059 0.539718
O  3.383018 -1.554144 -1.277125
C  1.206017 0.669886 0.330012
C  2.653461 0.374361 -0.038313
C  0.989405 2.127213 0.68106
C  2.896617 -1.097103 -0.281718
C  -0.698491 3.637748 1.369327
C  2.618266 -3.239856 0.694889
C  -1.136321 4.291378 0.07586
C  1.430082 -3.839579 -0.025717
C  -1.811393 -2.558136 -1.681528
C  -3.795719 0.902815 0.467258
H  0.874582 0.037187 1.159159
H  2.960395 0.931499 -0.922008
H  3.291865 0.705701 0.785533
H  -1.539997 3.527243 2.0521
H  0.069356 4.229543 1.870856
H  3.555667 -3.531114 0.218527
H  2.64552 -3.573007 1.731672
H  -1.590148 5.259014 0.292552
H  -1.871451 3.678348 -0.443931
H  -0.294556 4.464026 -0.592841
H  1.424731 -3.564378 -1.079893
H  0.495083 -3.513608 0.430377
H  1.477494 -4.927422 0.033939
H  -0.755755 -2.589384 -1.957307
H  -2.406825 -2.930521 -2.511606
H  -1.969174 -3.191497 -0.80748
H  -4.512656 0.211035 0.022868
H  -4.189918 1.913771 0.3995
H  -3.645558 0.640106 1.514845
totalener: -1981.83387897 hartree
nucrepener: 2175.58826125 hartree
electener: -4157.42214022 hartree
oneelecener: -7057.03854563 hartree
twoeener: 2899.61640542 hartree
kineticenergy: 1976.26702001 hartree
xcener: -133.550957493265 hartree
chargesum: -0.0000000
charge: -0.132135 -0.395882 0.647172 -0.260345 -0.263066 -0.323475 -0.313056 -0.350407 -0.346897 0.010275 -0.119387 0.314234 0.314775 0.002306 0.029460 -0.250599 -0.266146 -0.120467 -0.134515 0.127612 0.110020 0.107558 0.098097 0.103466 0.091628 0.096502 0.087450 0.086076 0.102218 0.095335 0.081523 0.091287 0.099411 0.120865 0.110805 0.125684 0.106172 0.116446
qa: -0.1321 -0.3959 0.6472 -0.2603 -0.2631 -0.3235 -0.3131 -0.3504 -0.3469 0.0103 -0.1194 0.3142 0.3148 0.0023 0.0295 -0.2506 -0.2661 -0.1205 -0.1345 0.1276 0.1100 0.1076 0.0981 0.1035 0.0916 0.0965 0.0875 0.0861 0.1022 0.0953 0.0815 0.0913 0.0994 0.1209 0.1108 0.1257 0.1062 0.1164
va: 2.3260 2.0562 5.4017 2.1350 2.1121 2.1083 2.1242 2.1498 2.1462 3.8042 3.8809 4.2603 4.2238 3.8712 3.8752 3.9119 3.9066 3.8867 3.8768 1.0685 1.0331 1.0197 0.9952 1.0099 1.0112 0.9952 1.0092 1.0098 1.0112 1.0085 1.0201 1.0154 0.9910 0.9957 0.9999 0.9913 0.9885 1.0017
dispcorr: -0.021607894 hartree
energy: -1981.855486860301
dipole: -3.94275 2.59431 -1.34844 -1.34968 1.18264 -0.16703 1.29786 -0.83245 0.46540
magnitude: 1.43624 au
magnitude: 3.65064 debye
