program: Orca
programVersion: 5.0.4
elementType: S S P O O O O O O C C C C C C C C C C H H H H H H H H H H H H H H H H H H H
charge: 0
multiplicity: 1
keywords: wb97x-d3
keywords: def2-TZVPP
keywords: def2/J RIJCOSX
keywords: DEFGRID2
keywords: scfconv7
keywords: smallprint printgap noloewdin
keywords: NOSOSCF
formula: C10H19O6PS2
InChI: InChI=1/C10H19O6PS2/c1-5-15-9(11)7-8(10(12)16-6-2)19-17(18,13-3)14-4/h8H,5-7H2,1-4H3
38 atoms
S  -0.615696 -0.140555 -0.872518
S  -3.144474 0.624628 1.282362
P  -2.317992 -0.729147 0.210255
O  1.71248 2.751763 0.29491
O  2.62069 -0.243697 0.416942
O  -1.944884 -2.029824 1.049696
O  -3.163699 -1.358233 -1.003597
O  1.305477 1.751671 -1.668065
O  1.585609 -1.856002 1.579478
C  0.105641 1.054124 0.301779
C  0.676841 0.374909 1.547118
C  1.116028 1.866802 -0.491034
C  1.655964 -0.720045 1.203091
C  2.73604 3.573671 -0.27915
C  3.550923 -1.16258 -0.163305
C  4.052067 2.838762 -0.420483
C  2.9905 -1.789222 -1.421326
C  -1.341737 -3.18421 0.472595
C  -3.861647 -0.501273 -1.900559
H  -0.698857 1.726429 0.619694
H  1.167408 1.125167 2.172516
H  -0.134092 -0.049678 2.13661
H  2.403856 3.969387 -1.240311
H  2.833646 4.407699 0.41446
H  4.430301 -0.560402 -0.389809
H  3.837047 -1.921285 0.566401
H  4.823215 3.541814 -0.737104
H  3.995032 2.049189 -1.167403
H  4.365008 2.402385 0.527561
H  2.127352 -2.417337 -1.205195
H  3.750771 -2.416944 -1.887308
H  2.689329 -1.027435 -2.139784
H  -2.076768 -3.761727 -0.087273
H  -0.958392 -3.778931 1.296386
H  -0.508585 -2.920503 -0.180043
H  -4.423004 -1.141822 -2.575988
H  -3.169109 0.112277 -2.479861
H  -4.549905 0.151217 -1.361857
totalener: -1981.83395906 hartree
nucrepener: 2171.79692560 hartree
electener: -4153.63088466 hartree
oneelecener: -7049.65982469 hartree
twoeener: 2896.02894003 hartree
kineticenergy: 1976.26125736 hartree
xcener: -133.553583637052 hartree
chargesum: -0.0000000
charge: -0.158674 -0.378911 0.637149 -0.270896 -0.259346 -0.298153 -0.332202 -0.348387 -0.350012 0.032756 -0.115122 0.313919 0.285362 0.017043 0.003889 -0.255451 -0.242706 -0.122532 -0.125149 0.121777 0.115505 0.112283 0.092540 0.101625 0.089461 0.104032 0.094446 0.091322 0.087932 0.088576 0.091178 0.096950 0.126474 0.128895 0.086204 0.116203 0.108964 0.113056
qa: -0.1587 -0.3789 0.6371 -0.2709 -0.2593 -0.2982 -0.3322 -0.3484 -0.3500 0.0328 -0.1151 0.3139 0.2854 0.0170 0.0039 -0.2555 -0.2427 -0.1225 -0.1251 0.1218 0.1155 0.1123 0.0925 0.1016 0.0895 0.1040 0.0944 0.0913 0.0879 0.0886 0.0912 0.0970 0.1265 0.1289 0.0862 0.1162 0.1090 0.1131
va: 2.3229 2.0890 5.4045 2.1459 2.0988 2.1305 2.0960 2.1330 2.1326 3.8954 3.7652 4.2966 4.2381 3.8854 3.8619 3.9042 3.9118 3.8729 3.8801 1.0537 1.0258 1.0450 1.0084 0.9949 0.9943 1.0126 1.0122 1.0105 1.0057 1.0068 1.0141 1.0078 0.9929 0.9903 1.0031 0.9915 0.9925 1.0013
dispcorr: -0.021681477 hartree
energy: -1981.855640533439
dipole: 20.78947 -19.56412 1.22535 -0.10809 0.34837 0.24028 -7.88042 7.10558 -0.77483
magnitude: 1.46955 au
magnitude: 3.73530 debye
