program: Orca
programVersion: 5.0.4
elementType: S S P O O O O O O C C C C C C C C C C H H H H H H H H H H H H H H H H H H H
charge: 0
multiplicity: 1
keywords: wb97x-d3
keywords: def2-TZVPP
keywords: def2/J RIJCOSX
keywords: DEFGRID2
keywords: scfconv7
keywords: smallprint printgap noloewdin
keywords: NOSOSCF
formula: C10H19O6PS2
InChI: InChI=1/C10H19O6PS2/c1-5-15-9(11)7-8(10(12)16-6-2)19-17(18,13-3)14-4/h8H,5-7H2,1-4H3
38 atoms
S  -0.516861 -0.771689 -0.148696
S  -2.766902 1.040012 1.679223
P  -2.421617 0.093091 0.051147
O  0.373538 1.902977 -1.023373
O  3.407173 -1.665487 1.667802
O  -3.309944 -1.216281 -0.251902
O  -2.7141 0.962448 -1.25306
O  2.34956 1.74111 0.018838
O  2.338343 -1.40525 -0.284348
C  0.510094 0.413075 0.786478
C  1.493454 -0.318798 1.67706
C  1.205596 1.407386 -0.121551
C  2.449573 -1.178102 0.889622
C  0.875561 2.878679 -1.941735
C  4.38336 -2.528414 1.076738
C  1.614012 2.237392 -3.096726
C  3.89222 -3.956251 0.970361
C  -3.532917 -2.16912 0.779293
C  -2.464962 0.482117 -2.567914
H  -0.179938 0.97645 1.428114
H  2.056915 0.398478 2.276647
H  0.946809 -0.948746 2.383163
H  -0.011765 3.404968 -2.291208
H  1.512168 3.595325 -1.420243
H  4.682968 -2.144404 0.100508
H  5.24347 -2.466336 1.742564
H  2.523642 1.739487 -2.766188
H  1.895531 3.00447 -3.81881
H  0.987917 1.508464 -3.611102
H  4.698808 -4.590943 0.601873
H  3.057747 -4.044071 0.276734
H  3.583382 -4.342923 1.941416
H  -4.143333 -2.960358 0.351218
H  -4.059722 -1.717901 1.620822
H  -2.593822 -2.597071 1.136807
H  -2.629681 1.320593 -3.240448
H  -3.149107 -0.324654 -2.832005
H  -1.436246 0.134534 -2.677166
totalener: -1981.83487401 hartree
nucrepener: 2122.96542480 hartree
electener: -4104.80029881 hartree
oneelecener: -6952.39138163 hartree
twoeener: 2847.59108282 hartree
kineticenergy: 1976.27091855 hartree
xcener: -133.554810383223 hartree
chargesum: -0.0000000
charge: -0.158271 -0.380582 0.636704 -0.262832 -0.276495 -0.331825 -0.298174 -0.364037 -0.375962 0.069607 -0.178953 0.320403 0.382173 0.000746 0.031954 -0.243220 -0.255165 -0.120820 -0.143301 0.113439 0.114429 0.114185 0.102011 0.100660 0.089685 0.098183 0.105335 0.084988 0.078867 0.083485 0.099272 0.083371 0.115827 0.114674 0.099623 0.116347 0.132514 0.101154
qa: -0.1583 -0.3806 0.6367 -0.2628 -0.2765 -0.3318 -0.2982 -0.3640 -0.3760 0.0696 -0.1790 0.3204 0.3822 0.0007 0.0320 -0.2432 -0.2552 -0.1208 -0.1433 0.1134 0.1144 0.1142 0.1020 0.1007 0.0897 0.0982 0.1053 0.0850 0.0789 0.0835 0.0993 0.0834 0.1158 0.1147 0.0996 0.1163 0.1325 0.1012
va: 2.3043 2.0911 5.4003 2.1382 2.1537 2.0826 2.1298 2.1367 2.1019 3.8373 3.9537 4.2370 4.1406 3.8742 3.8799 3.9168 3.9149 3.8812 3.8756 1.0829 1.0263 1.0245 0.9938 1.0123 1.0106 0.9948 1.0128 1.0093 1.0030 1.0101 1.0113 1.0052 0.9925 1.0009 0.9980 0.9882 0.9938 0.9980
dispcorr: -0.018639039 hartree
energy: -1981.853513050088
dipole: 14.62457 -14.22223 0.40234 -8.16614 7.24186 -0.92428 -8.62566 8.01971 -0.60595
magnitude: 1.17616 au
magnitude: 2.98955 debye
