program: Orca
programVersion: 5.0.4
elementType: S S P O O O O O O C C C C C C C C C C H H H H H H H H H H H H H H H H H H H
charge: 0
multiplicity: 1
keywords: wb97x-d3
keywords: def2-TZVPP
keywords: def2/J RIJCOSX
keywords: DEFGRID2
keywords: scfconv7
keywords: smallprint printgap noloewdin
keywords: NOSOSCF
formula: C10H19O6PS2
InChI: InChI=1/C10H19O6PS2/c1-5-15-9(11)7-8(10(12)16-6-2)19-17(18,13-3)14-4/h8H,5-7H2,1-4H3
38 atoms
S  -0.804406 -0.910631 0.402238
S  -2.339734 2.13633 0.611988
P  -2.344875 0.394472 -0.182213
O  0.480247 1.000173 -1.329194
O  3.161473 -2.103811 1.819606
O  -3.61395 -0.547225 0.126647
O  -2.387643 0.420491 -1.77526
O  2.214015 1.590416 -0.040569
O  2.220472 -1.638855 -0.160022
C  0.489596 0.261548 0.916122
C  1.501054 -0.454157 1.796007
C  1.179808 1.00613 -0.213032
C  2.320564 -1.457288 1.021983
C  0.905742 1.841107 -2.405608
C  4.050699 -3.057421 1.227573
C  0.455884 3.271495 -2.20295
C  5.265769 -2.397303 0.612826
C  -4.068784 -0.705301 1.463344
C  -2.198955 -0.744005 -2.570359
H  -0.011561 1.028132 1.517648
H  2.177307 0.284565 2.232428
H  1.001615 -0.945644 2.633578
H  1.987694 1.773602 -2.527806
H  0.435693 1.410605 -3.288569
H  4.341199 -3.708787 2.050998
H  3.519214 -3.660619 0.489777
H  0.685365 3.853939 -3.095829
H  0.965261 3.737851 -1.361418
H  -0.618357 3.321108 -2.02879
H  5.955206 -3.164965 0.259812
H  5.795423 -1.784795 1.341938
H  4.99879 -1.773744 -0.238301
H  -4.345698 0.25573 1.898452
H  -3.306274 -1.172984 2.089914
H  -4.9428 -1.350756 1.425186
H  -1.206787 -1.168895 -2.415384
H  -2.296011 -0.428467 -3.60648
H  -2.955337 -1.501693 -2.361007
totalener: -1981.83362684 hartree
nucrepener: 2147.85590106 hartree
electener: -4129.68952789 hartree
oneelecener: -7002.29065659 hartree
twoeener: 2872.60112870 hartree
kineticenergy: 1976.28100221 hartree
xcener: -133.558581106915 hartree
chargesum: -0.0000000
charge: -0.173652 -0.383334 0.658647 -0.259135 -0.276845 -0.332312 -0.304022 -0.370750 -0.362632 0.079802 -0.186031 0.317307 0.362667 0.016800 0.028296 -0.242086 -0.251596 -0.123106 -0.159969 0.107479 0.120511 0.117517 0.100783 0.088012 0.098582 0.088013 0.084050 0.097698 0.091554 0.081589 0.085461 0.102380 0.114282 0.098437 0.116377 0.119861 0.119582 0.129780
qa: -0.1737 -0.3833 0.6586 -0.2591 -0.2768 -0.3323 -0.3040 -0.3707 -0.3626 0.0798 -0.1860 0.3173 0.3627 0.0168 0.0283 -0.2421 -0.2516 -0.1231 -0.1600 0.1075 0.1205 0.1175 0.1008 0.0880 0.0986 0.0880 0.0840 0.0977 0.0916 0.0816 0.0855 0.1024 0.1143 0.0984 0.1164 0.1199 0.1196 0.1298
va: 2.2937 2.0767 5.3886 2.1186 2.1505 2.0973 2.1168 2.1396 2.1184 3.8831 3.9124 4.2280 4.1744 3.8711 3.8821 3.9087 3.9177 3.8790 3.8728 1.0562 1.0256 1.0251 1.0122 0.9936 0.9940 1.0099 1.0113 1.0114 1.0146 1.0092 1.0056 1.0118 1.0019 0.9990 0.9925 0.9898 0.9889 0.9932
dispcorr: -0.019591108 hartree
energy: -1981.853217946189
dipole: 14.10778 -13.92395 0.18384 -4.92794 3.53833 -1.38961 -4.34961 4.37571 0.02611
magnitude: 1.40196 au
magnitude: 3.56351 debye
