program: Orca
programVersion: 5.0.4
elementType: S P O O O O N C C C C C C C C C C C C C H H H H H H H H H H H H H H H H
charge: 0
multiplicity: 1
keywords: wb97x-d3
keywords: def2-TZVPP
keywords: def2/J RIJCOSX
keywords: DEFGRID2
keywords: scfconv7
keywords: smallprint printgap noloewdin
keywords: NOSOSCF
formula: C13H16NO4PS
InChI: InChI=1/C13H16NO4PS/c1-3-15-19(20,16-4-2)18-13-10-12(17-14-13)11-8-6-5-7-9-11/h5-10H,3-4H2,1-2H3
36 atoms
S  -1.875779 -1.423593 1.424101
P  -2.225966 -0.471006 -0.198915
O  -1.083851 -0.611953 -1.35779
O  -2.336802 1.109279 -0.135757
O  -3.503578 -0.883739 -1.039621
O  2.289476 -0.598631 -1.584495
N  1.047515 -0.956844 -2.011925
C  2.204895 0.136387 -0.467402
C  3.443281 0.613024 0.127949
C  0.232147 -0.432005 -1.147624
C  0.897335 0.283693 -0.128823
C  -3.104608 1.76253 0.907773
C  -4.040147 -2.229951 -1.035734
C  4.660846 0.490129 -0.5442
C  3.414856 1.204487 1.392097
C  5.827126 0.953564 0.043387
C  4.584382 1.665147 1.972627
C  -2.195644 2.298424 1.982436
C  -5.204257 -2.332433 -0.085595
C  5.793811 1.540871 1.300825
H  0.481794 0.827743 0.702056
H  -3.645739 2.563981 0.408235
H  -3.844196 1.075729 1.324122
H  -4.345966 -2.419925 -2.063094
H  -3.259081 -2.948059 -0.781459
H  4.708198 0.041176 -1.52732
H  2.479468 1.300166 1.928558
H  -2.795616 2.843778 2.712077
H  -1.676593 1.496402 2.506707
H  -1.457963 2.988901 1.573598
H  -5.98955 -1.619926 -0.337205
H  -5.628239 -3.334844 -0.150496
H  -4.895047 -2.165737 0.946093
H  6.765599 0.855769 -0.485719
H  4.55152 2.119568 2.9537
H  6.707026 1.900363 1.756289
elementType: S P O N C H
totalener: -1600.37837194 hartree
nucrepener: 1866.60401920 hartree
electener: -3466.98239114 hartree
oneelecener: -5906.79462773 hartree
twoeener: 2439.81223659 hartree
cpcmener: -0.02790545 hartree
kineticenergy: 1595.27505792 hartree
xcener: -117.831006206250 hartree
chargesum: 0.0000000
charge: -0.428716 0.757524 -0.314003 -0.343594 -0.350326 -0.147482 -0.210246 0.345449 -0.010577 0.272988 -0.251972 0.048978 0.048299 -0.184088 -0.195051 -0.162208 -0.154860 -0.249368 -0.235926 -0.131226 0.166463 0.109950 0.093956 0.110026 0.090553 0.150110 0.147736 0.106895 0.078800 0.091828 0.090939 0.097687 0.076265 0.160790 0.161394 0.163015
qa: -0.4287 0.7575 -0.3140 -0.3436 -0.3503 -0.1475 -0.2102 0.3454 -0.0106 0.2730 -0.2520 0.0490 0.0483 -0.1841 -0.1951 -0.1622 -0.1549 -0.2494 -0.2359 -0.1312 0.1665 0.1100 0.0940 0.1100 0.0906 0.1501 0.1477 0.1069 0.0788 0.0918 0.0909 0.0977 0.0763 0.1608 0.1614 0.1630
va: 1.9837 5.4925 2.1737 2.0989 2.1169 2.2329 2.8049 3.7477 3.6666 4.1884 3.9524 3.8562 3.8396 3.9520 3.9604 3.9137 3.9066 3.9105 3.9202 3.8914 0.9901 0.9972 1.0027 0.9963 1.0111 1.0159 1.0063 1.0095 1.0159 1.0022 1.0038 1.0082 1.0176 0.9933 0.9919 0.9885
dispcorr: -0.015645420 hartree
energy: -1600.394017359084
dipole: -9.03447 8.25592 -0.77855 6.18181 -4.69556 1.48625 10.42183 -8.86196 1.55987
magnitude: 2.29091 au
magnitude: 5.82303 debye
