program: Orca
programVersion: 5.0.4
elementType: S P O O O O N C C C C C C C C C C C C C H H H H H H H H H H H H H H H H
charge: 0
multiplicity: 1
keywords: wb97x-d3
keywords: def2-TZVPP
keywords: def2/J RIJCOSX
keywords: DEFGRID2
keywords: scfconv7
keywords: smallprint printgap noloewdin
keywords: NOSOSCF
formula: C13H16NO4PS
InChI: InChI=1/C13H16NO4PS/c1-3-15-19(20,16-4-2)18-13-10-12(17-14-13)11-8-6-5-7-9-11/h5-10H,3-4H2,1-2H3
36 atoms
S  -3.977162 -0.811714 1.187779
P  -2.535795 -0.327977 0.028057
O  -1.229021 0.091208 0.927835
O  -2.753998 0.871266 -0.984127
O  -1.969325 -1.40071 -0.996288
O  1.49879 1.385598 -0.65743
N  0.160837 1.369128 -0.413503
C  2.113314 0.410379 0.029911
C  3.560063 0.308836 -0.079923
C  -0.016896 0.377562 0.407459
C  1.182979 -0.284509 0.735577
C  -3.615966 1.996526 -0.705222
C  -2.050471 -2.822646 -0.745996
C  4.227753 -0.716927 0.591933
C  4.296651 1.231405 -0.826062
C  5.60736 -0.811228 0.525939
C  5.677396 1.130845 -0.886832
C  -3.10116 2.88349 0.4010
C  -1.091528 -3.283347 0.322318
C  6.336799 0.112985 -0.211261
H  1.315923 -1.126444 1.393102
H  -3.660972 2.538118 -1.647794
H  -4.617957 1.626969 -0.480441
H  -3.079619 -3.081582 -0.491273
H  -1.816396 -3.280665 -1.704557
H  3.670915 -1.442466 1.170994
H  3.803201 2.034673 -1.356789
H  -3.75454 3.752872 0.476591
H  -3.110112 2.38414 1.370276
H  -2.092355 3.239838 0.197105
H  -1.345046 -2.884132 1.304877
H  -1.141997 -4.370476 0.388513
H  -0.063682 -3.010321 0.084854
H  6.115001 -1.607713 1.05329
H  6.239765 1.8538 -1.462575
H  7.415424 0.041003 -0.256969
elementType: S P O N C H
totalener: -1600.37653450 hartree
nucrepener: 1881.72706417 hartree
electener: -3482.10359867 hartree
oneelecener: -5937.49873802 hartree
twoeener: 2455.39513935 hartree
cpcmener: -0.02789827 hartree
kineticenergy: 1595.27049324 hartree
xcener: -117.830666062648 hartree
chargesum: 0.0000000
charge: -0.422384 0.715208 -0.333650 -0.334708 -0.343131 -0.148773 -0.218746 0.415573 -0.021102 0.304590 -0.305816 0.026767 0.038209 -0.183555 -0.191485 -0.162140 -0.161679 -0.245853 -0.254702 -0.128381 0.179614 0.114138 0.100594 0.097375 0.113485 0.150324 0.150131 0.106974 0.083405 0.087243 0.086733 0.108985 0.091164 0.161051 0.160766 0.163777
qa: -0.4224 0.7152 -0.3337 -0.3347 -0.3431 -0.1488 -0.2187 0.4156 -0.0211 0.3046 -0.3058 0.0268 0.0382 -0.1836 -0.1915 -0.1621 -0.1617 -0.2459 -0.2547 -0.1284 0.1796 0.1141 0.1006 0.0974 0.1135 0.1503 0.1501 0.1070 0.0834 0.0872 0.0867 0.1090 0.0912 0.1611 0.1608 0.1638
va: 2.0175 5.5062 2.0964 2.1092 2.1033 2.2260 2.7809 3.6252 3.6910 4.0759 3.9457 3.8497 3.8418 3.9447 3.9593 3.9104 3.9117 3.8825 3.8943 3.8880 0.9888 0.9920 1.0087 1.0097 0.9924 1.0062 1.0166 1.0092 1.0175 1.0171 1.0152 1.0100 1.0021 0.9925 0.9933 0.9882
dispcorr: -0.016364210 hartree
energy: -1600.392898711830
dipole: 5.65432 -3.72329 1.93103 -2.84244 1.81376 -1.02868 -0.07462 0.04155 -0.03307
magnitude: 2.18818 au
magnitude: 5.56192 debye
