program: Orca
programVersion: 5.0.4
elementType: S P O O O O N C C C C C C C C C C C C C H H H H H H H H H H H H H H H H
charge: 0
multiplicity: 1
keywords: wb97x-d3
keywords: def2-TZVPP
keywords: def2/J RIJCOSX
keywords: DEFGRID2
keywords: scfconv7
keywords: smallprint printgap noloewdin
keywords: NOSOSCF
formula: C13H16NO4PS
InChI: InChI=1/C13H16NO4PS/c1-3-15-19(20,16-4-2)18-13-10-12(17-14-13)11-8-6-5-7-9-11/h5-10H,3-4H2,1-2H3
36 atoms
S  -1.37052 -2.044352 1.422571
P  -2.080526 -0.931273 0.039336
O  -1.047936 -0.487892 -1.151653
O  -2.647888 0.438089 0.605235
O  -3.158377 -1.548569 -0.950933
O  1.600857 1.619829 -0.938841
N  0.307779 1.34398 -1.254158
C  2.188995 0.54568 -0.38942
C  3.584442 0.657821 0.003795
C  0.134342 0.107299 -0.897115
C  1.289893 -0.471476 -0.336387
C  -3.407591 1.376194 -0.203968
C  -4.139885 -2.513403 -0.508526
C  4.323786 1.811311 -0.264295
C  4.19757 -0.411927 0.658714
C  5.653954 1.886276 0.117156
C  5.5271 -0.330207 1.034994
C  -2.914324 2.772672 0.064656
C  -5.195443 -1.902345 0.378087
C  6.259318 0.81942 0.766899
H  1.424528 -1.475923 0.024634
H  -3.322013 1.137006 -1.264615
H  -4.452814 1.262255 0.082674
H  -4.576339 -2.897971 -1.427873
H  -3.628261 -3.336353 -0.006525
H  3.87335 2.653527 -0.772239
H  3.636323 -1.311711 0.876134
H  -1.881303 2.898905 -0.257228
H  -3.529043 3.476208 -0.497189
H  -2.989922 3.03314 1.120136
H  -4.792042 -1.574091 1.336665
H  -5.686471 -1.05792 -0.105298
H  -5.955182 -2.656386 0.584774
H  6.219407 2.783659 -0.095597
H  5.991588 -1.165103 1.5423
H  7.298095 0.882649 1.062652
elementType: S P O N C H
totalener: -1600.37759384 hartree
nucrepener: 1864.68645844 hartree
electener: -3465.06405228 hartree
oneelecener: -5903.35536935 hartree
twoeener: 2438.29131706 hartree
cpcmener: -0.02632131 hartree
kineticenergy: 1595.27067378 hartree
xcener: -117.828159884969 hartree
chargesum: -0.0000000
charge: -0.414425 0.701937 -0.329684 -0.333918 -0.335914 -0.146661 -0.213824 0.375261 -0.008653 0.296380 -0.280798 0.035945 0.035054 -0.190434 -0.187687 -0.158384 -0.155315 -0.245207 -0.251123 -0.132149 0.170253 0.107113 0.110548 0.112523 0.098645 0.150104 0.150277 0.082959 0.094101 0.090902 0.087632 0.091380 0.108054 0.160695 0.160841 0.163571
qa: -0.4144 0.7019 -0.3297 -0.3339 -0.3359 -0.1467 -0.2138 0.3753 -0.0087 0.2964 -0.2808 0.0359 0.0351 -0.1904 -0.1877 -0.1584 -0.1553 -0.2452 -0.2511 -0.1321 0.1703 0.1071 0.1105 0.1125 0.0986 0.1501 0.1503 0.0830 0.0941 0.0909 0.0876 0.0914 0.1081 0.1607 0.1608 0.1636
va: 2.0396 5.5229 2.1385 2.0655 2.0917 2.2320 2.7910 3.6952 3.6735 4.1082 3.9945 3.8339 3.8437 3.9589 3.9493 3.9088 3.9081 3.9631 3.8897 3.8915 1.0009 0.9954 0.9931 0.9923 1.0106 1.0157 1.0052 1.0161 1.0068 1.0033 1.0135 1.0036 1.0094 0.9932 0.9922 0.9883
dispcorr: -0.016003948 hartree
energy: -1600.393597793180
dipole: -10.21778 9.74619 -0.47159 4.30530 -4.55610 -0.25080 2.05619 -2.19212 -0.13593
magnitude: 0.55116 au
magnitude: 1.40094 debye
