program: Orca
programVersion: 5.0.4
elementType: S P O O O O N C C C C C C C C C C C C C H H H H H H H H H H H H H H H H
charge: 0
multiplicity: 1
keywords: wb97x-d3
keywords: def2-TZVPP
keywords: def2/J RIJCOSX
keywords: DEFGRID2
keywords: scfconv7
keywords: smallprint printgap noloewdin
keywords: NOSOSCF
formula: C13H16NO4PS
InChI: InChI=1/C13H16NO4PS/c1-3-15-19(20,16-4-2)18-13-10-12(17-14-13)11-8-6-5-7-9-11/h5-10H,3-4H2,1-2H3
36 atoms
S  -2.499039 0.116023 2.153628
P  -2.481236 -0.162161 0.264748
O  -1.133413 0.396439 -0.504869
O  -3.56911 0.574763 -0.622566
O  -2.619484 -1.674611 -0.168899
O  1.766776 -0.994408 0.620344
N  0.410835 -1.016832 0.489315
C  2.27378 0.099891 0.032637
C  3.71746 0.273532 0.059333
C  0.120361 0.067578 -0.164383
C  1.25788 0.832851 -0.492373
C  -3.901914 1.972092 -0.427898
C  -2.64149 -2.112441 -1.555164
C  4.29059 1.372874 -0.582317
C  4.54306 -0.648152 0.706247
C  5.66437 1.544003 -0.579328
C  5.917209 -0.470408 0.704378
C  -5.228663 2.099631 0.273171
C  -1.810595 -3.361529 -1.679456
C  6.482385 0.622495 0.062031
H  1.298268 1.76617 -1.027489
H  -3.113842 2.47988 0.130928
H  -3.933667 2.408246 -1.424816
H  -3.68292 -2.297273 -1.816627
H  -2.260056 -1.332116 -2.214856
H  3.665049 2.097032 -1.088483
H  4.124556 -1.508025 1.211897
H  -5.488171 3.155152 0.354817
H  -6.023473 1.602183 -0.281896
H  -5.189273 1.684059 1.279582
H  -1.853142 -3.711534 -2.710449
H  -0.766596 -3.172334 -1.433025
H  -2.184402 -4.16024 -1.039843
H  6.097628 2.398812 -1.081013
H  6.547881 -1.191579 1.206808
H  7.555999 0.75613 0.060828
elementType: S P O N C H
totalener: -1600.37859352 hartree
nucrepener: 1850.84556976 hartree
electener: -3451.22416328 hartree
oneelecener: -5875.99763462 hartree
twoeener: 2424.77347133 hartree
cpcmener: -0.03233532 hartree
kineticenergy: 1595.27076206 hartree
xcener: -117.828521819959 hartree
chargesum: 0.0000000
charge: -0.417331 0.715328 -0.320756 -0.334178 -0.342851 -0.156870 -0.240627 0.388787 -0.019481 0.347049 -0.296413 0.041486 0.032894 -0.183287 -0.192628 -0.166090 -0.163784 -0.233190 -0.241229 -0.126441 0.176187 0.091575 0.110373 0.111694 0.107010 0.150591 0.149570 0.095377 0.090350 0.074499 0.093539 0.081980 0.091039 0.161014 0.160838 0.163975
qa: -0.4173 0.7153 -0.3208 -0.3342 -0.3429 -0.1569 -0.2406 0.3888 -0.0195 0.3470 -0.2964 0.0415 0.0329 -0.1833 -0.1926 -0.1661 -0.1638 -0.2332 -0.2412 -0.1264 0.1762 0.0916 0.1104 0.1117 0.1070 0.1506 0.1496 0.0954 0.0903 0.0745 0.0935 0.0820 0.0910 0.1610 0.1608 0.1640
va: 2.0279 5.5210 2.1152 2.0907 2.1055 2.2258 2.7429 3.6581 3.6796 4.0380 3.9583 3.8460 3.8435 3.9461 3.9609 3.9137 3.9139 3.9314 3.9462 3.8861 0.9932 1.0044 0.9956 0.9953 0.9960 1.0059 1.0173 1.0079 1.0042 1.0184 1.0074 1.0109 1.0027 0.9925 0.9934 0.9881
dispcorr: -0.015098163 hartree
energy: -1600.393691683215
dipole: -2.81475 3.73722 0.92247 1.66626 -0.12333 1.54293 -10.45364 7.69467 -2.75896
magnitude: 3.29294 au
magnitude: 8.36999 debye
