program: Orca
programVersion: 5.0.4
elementType: S P O O O O N C C C C C C C C C C C C C H H H H H H H H H H H H H H H H
charge: 0
multiplicity: 1
keywords: wb97x-d3
keywords: def2-TZVPP
keywords: def2/J RIJCOSX
keywords: DEFGRID2
keywords: scfconv7
keywords: smallprint printgap noloewdin
keywords: NOSOSCF
formula: C13H16NO4PS
InChI: InChI=1/C13H16NO4PS/c1-3-15-19(20,16-4-2)18-13-10-12(17-14-13)11-8-6-5-7-9-11/h5-10H,3-4H2,1-2H3
36 atoms
S  -2.080876 -1.963604 1.36279
P  -2.305456 -0.561307 0.085022
O  -0.947516 -0.178489 -0.765788
O  -2.804623 0.796643 0.717781
O  -3.271864 -0.792518 -1.150562
O  1.634295 0.913123 1.173772
N  0.301879 0.696379 0.980864
C  2.33045 0.516878 0.097403
C  3.775387 0.677474 0.118309
C  0.219143 0.165175 -0.201911
C  1.471143 0.022289 -0.830658
C  -3.033246 2.0219 -0.025996
C  -3.477035 -2.09081 -1.757989
C  4.505897 0.413007 -1.041456
C  4.445867 1.088223 1.271811
C  5.882704 0.55412 -1.046849
C  5.82496 1.225774 1.259289
C  -4.510261 2.265624 -0.191315
C  -4.701523 -2.758096 -1.187806
C  6.546894 0.959067 0.104098
H  1.681472 -0.388131 -1.803443
H  -2.567382 2.807688 0.566059
H  -2.526435 1.989117 -0.991228
H  -3.59247 -1.893136 -2.821787
H  -2.59016 -2.712946 -1.628155
H  3.998587 0.100756 -1.945056
H  3.903159 1.295582 2.184342
H  -5.020564 2.289447 0.771245
H  -4.656349 3.234242 -0.669731
H  -4.978943 1.508261 -0.818557
H  -4.572299 -2.998892 -0.133554
H  -5.585358 -2.13037 -1.298924
H  -4.883241 -3.688781 -1.725825
H  6.438122 0.348159 -1.951915
H  6.33697 1.54203 2.15814
H  7.623113 1.068974 0.098985
elementType: S P O N C H
totalener: -1600.37812668 hartree
nucrepener: 1845.72266890 hartree
electener: -3446.10079558 hartree
oneelecener: -5865.79771246 hartree
twoeener: 2419.69691688 hartree
cpcmener: -0.03198527 hartree
kineticenergy: 1595.27810669 hartree
xcener: -117.830510829118 hartree
chargesum: -0.0000000
charge: -0.420560 0.722093 -0.321706 -0.343524 -0.333403 -0.157610 -0.234500 0.390230 -0.017896 0.326156 -0.287836 0.042834 0.034946 -0.180725 -0.193575 -0.168146 -0.163797 -0.245776 -0.234060 -0.126337 0.175744 0.107055 0.106699 0.110577 0.095161 0.150637 0.149847 0.089206 0.096065 0.083332 0.076025 0.090333 0.096552 0.161121 0.160824 0.164014
qa: -0.4206 0.7221 -0.3217 -0.3435 -0.3334 -0.1576 -0.2345 0.3902 -0.0179 0.3262 -0.2878 0.0428 0.0349 -0.1807 -0.1936 -0.1681 -0.1638 -0.2458 -0.2341 -0.1263 0.1757 0.1071 0.1067 0.1106 0.0952 0.1506 0.1498 0.0892 0.0961 0.0833 0.0760 0.0903 0.0966 0.1611 0.1608 0.1640
va: 2.0217 5.5071 2.1278 2.1004 2.0912 2.2286 2.7460 3.6531 3.6706 4.0641 3.9553 3.8361 3.8417 3.9438 3.9615 3.9160 3.9156 3.9466 3.9233 3.8855 0.9928 0.9950 0.9976 0.9957 1.0063 1.0056 1.0165 1.0033 1.0067 1.0123 1.0205 1.0041 1.0081 0.9926 0.9933 0.9880
dispcorr: -0.015007315 hartree
energy: -1600.393133994614
dipole: -8.28699 9.04937 0.76238 2.59933 -1.95143 0.64790 -9.87783 6.98428 -2.89355
magnitude: 3.06164 au
magnitude: 7.78207 debye
