program: Orca
programVersion: 5.0.4
elementType: S P O O O O N C C C C C C C C C C C C C H H H H H H H H H H H H H H H H
charge: 0
multiplicity: 1
keywords: wb97x-d3
keywords: def2-TZVPP
keywords: def2/J RIJCOSX
keywords: DEFGRID2
keywords: scfconv7
keywords: smallprint printgap noloewdin
keywords: NOSOSCF
formula: C13H16NO4PS
InChI: InChI=1/C13H16NO4PS/c1-3-15-19(20,16-4-2)18-13-10-12(17-14-13)11-8-6-5-7-9-11/h5-10H,3-4H2,1-2H3
36 atoms
S  -1.872366 -0.160408 1.926885
P  -2.133602 -0.294978 0.035353
O  -1.001211 -1.143115 -0.783065
O  -2.119566 1.045248 -0.812423
O  -3.430929 -1.034213 -0.487458
O  2.368067 -1.371639 -0.975394
N  1.105776 -1.836646 -1.193991
C  2.326733 -0.197379 -0.331814
C  3.587386 0.447115 0.000721
C  0.323207 -0.934527 -0.682471
C  1.030488 0.147407 -0.115252
C  -2.673867 2.28318 -0.310813
C  -4.000499 -2.204951 0.143417
C  3.576139 1.604462 0.781284
C  4.807433 -0.072412 -0.435744
C  4.763922 2.227229 1.123686
C  5.992807 0.556298 -0.088255
C  -4.177777 2.24227 -0.207693
C  -5.498577 -2.063335 0.155329
C  5.976128 1.704477 0.691607
H  0.648581 1.03085 0.366183
H  -2.214621 2.514326 0.651938
H  -2.350756 3.034782 -1.028023
H  -3.682368 -3.073786 -0.432612
H  -3.611871 -2.30764 1.158058
H  2.638624 2.018623 1.129154
H  4.843711 -0.965167 -1.045664
H  -4.637532 1.964084 -1.15565
H  -4.522035 1.553998 0.565191
H  -4.536146 3.236883 0.058671
H  -5.902102 -1.961645 -0.851901
H  -5.935594 -2.956378 0.601701
H  -5.810906 -1.203443 0.747693
H  4.742846 3.12122 1.732311
H  6.933628 0.14544 -0.429105
H  6.904109 2.190604 0.961926
elementType: S P O N C H
totalener: -1600.37927121 hartree
nucrepener: 1856.94214335 hartree
electener: -3457.32141455 hartree
oneelecener: -5887.49679732 hartree
twoeener: 2430.17538277 hartree
cpcmener: -0.02760661 hartree
kineticenergy: 1595.27716563 hartree
xcener: -117.832121085878 hartree
chargesum: 0.0000000
charge: -0.426488 0.741960 -0.314485 -0.342436 -0.339862 -0.147520 -0.214509 0.335136 -0.009069 0.281861 -0.245857 0.041109 0.048761 -0.192948 -0.185977 -0.153532 -0.159115 -0.239314 -0.239245 -0.134271 0.158311 0.097423 0.113070 0.110701 0.086586 0.148384 0.151101 0.094674 0.076454 0.100901 0.092020 0.094047 0.086055 0.161570 0.160468 0.164037
qa: -0.4265 0.7420 -0.3145 -0.3424 -0.3399 -0.1475 -0.2145 0.3351 -0.0091 0.2819 -0.2459 0.0411 0.0488 -0.1929 -0.1860 -0.1535 -0.1591 -0.2393 -0.2392 -0.1343 0.1583 0.0974 0.1131 0.1107 0.0866 0.1484 0.1511 0.0947 0.0765 0.1009 0.0920 0.0940 0.0861 0.1616 0.1605 0.1640
va: 1.9974 5.5089 2.1790 2.0993 2.1266 2.2330 2.8054 3.7786 3.6709 4.1749 3.9458 3.8372 3.8224 3.9557 3.9557 3.9057 3.9104 3.9133 3.9379 3.8924 1.0067 1.0076 0.9918 0.9956 1.0135 1.0060 1.0153 1.0059 1.0136 1.0092 1.0035 1.0081 1.0052 0.9920 0.9933 0.9882
dispcorr: -0.015307599 hartree
energy: -1600.394578806631
dipole: -13.49551 12.83859 -0.65692 8.17053 -6.19453 1.97599 2.29834 -1.79178 0.50656
magnitude: 2.14306 au
magnitude: 5.44722 debye
