program: Orca
programVersion: 5.0.4
elementType: S P O O O O N C C C C C C C C C C C C C H H H H H H H H H H H H H H H H
charge: 0
multiplicity: 1
keywords: wb97x-d3
keywords: def2-TZVPP
keywords: def2/J RIJCOSX
keywords: DEFGRID2
keywords: scfconv7
keywords: smallprint printgap noloewdin
keywords: NOSOSCF
formula: C13H16NO4PS
InChI: InChI=1/C13H16NO4PS/c1-3-15-19(20,16-4-2)18-13-10-12(17-14-13)11-8-6-5-7-9-11/h5-10H,3-4H2,1-2H3
36 atoms
S  -1.779465 -0.842646 1.585485
P  -2.369408 -0.216893 -0.123589
O  -1.200053 -0.010735 -1.246522
O  -3.019335 1.224799 -0.238459
O  -3.423596 -1.116136 -0.901476
O  2.054274 -0.947757 -1.234658
N  0.759319 -1.105762 -1.61384
C  2.174235 0.094491 -0.39693
C  3.501548 0.409226 0.106294
C  0.11594 -0.155742 -1.005717
C  0.949801 0.651671 -0.207551
C  -4.204325 1.560164 0.526197
C  -3.508608 -2.548028 -0.745289
C  4.616681 -0.336799 -0.281137
C  3.664777 1.474451 0.993578
C  5.870461 -0.019852 0.216143
C  4.920815 1.785025 1.48614
C  -3.84762 2.395574 1.729037
C  -2.361359 -3.268245 -1.408487
C  6.027113 1.038318 1.10075
H  0.674237 1.500651 0.394261
H  -4.846077 2.10927 -0.160753
H  -4.740951 0.656517 0.823362
H  -3.567035 -2.790802 0.317181
H  -4.457826 -2.817628 -1.204197
H  4.516331 -1.164891 -0.969929
H  2.81067 2.063034 1.303162
H  -3.252399 1.833059 2.447575
H  -3.29792 3.292358 1.443746
H  -4.765779 2.709968 2.225573
H  -2.263092 -2.986767 -2.456695
H  -1.412776 -3.082047 -0.904196
H  -2.549362 -4.34115 -1.365973
H  6.728296 -0.603562 -0.089878
H  5.036156 2.611538 2.174404
H  7.007809 1.281471 1.487499
elementType: S P O N C H
totalener: -1600.37746770 hartree
nucrepener: 1867.61626092 hartree
electener: -3467.99372862 hartree
oneelecener: -5909.36816262 hartree
twoeener: 2441.37443400 hartree
cpcmener: -0.02677414 hartree
kineticenergy: 1595.27909692 hartree
xcener: -117.831898153352 hartree
chargesum: 0.0000000
charge: -0.426515 0.753675 -0.335518 -0.350233 -0.346450 -0.146239 -0.205810 0.399033 -0.013011 0.280238 -0.291857 0.039103 0.040111 -0.188642 -0.188362 -0.159822 -0.157244 -0.237899 -0.237044 -0.132890 0.177201 0.108905 0.095371 0.095729 0.112031 0.150609 0.151781 0.075208 0.090381 0.096913 0.092922 0.069014 0.102386 0.161377 0.161564 0.163984
qa: -0.4265 0.7537 -0.3355 -0.3502 -0.3464 -0.1462 -0.2058 0.3990 -0.0130 0.2802 -0.2919 0.0391 0.0401 -0.1886 -0.1884 -0.1598 -0.1572 -0.2379 -0.2370 -0.1329 0.1772 0.1089 0.0954 0.0957 0.1120 0.1506 0.1518 0.0752 0.0904 0.0969 0.0929 0.0690 0.1024 0.1614 0.1616 0.1640
va: 1.9933 5.4898 2.1261 2.1150 2.1072 2.2289 2.7906 3.6247 3.6786 4.1177 3.9578 3.8709 3.8437 3.9568 3.9490 3.9099 3.9089 3.9324 3.8949 3.8925 0.9960 0.9942 0.9994 1.0099 0.9930 1.0162 1.0050 1.0174 1.0035 1.0080 1.0069 1.0223 1.0103 0.9931 0.9922 0.9882
dispcorr: -0.015596742 hartree
energy: -1600.393064437845
dipole: -5.66162 5.15912 -0.50250 1.60787 -0.57525 1.03262 5.24899 -4.31876 0.93023
magnitude: 1.47788 au
magnitude: 3.75647 debye
