program: Orca
programVersion: 5.0.4
elementType: S P O O O O N C C C C C C C C C C C C C H H H H H H H H H H H H H H H H
charge: 0
multiplicity: 1
keywords: wb97x-d3
keywords: def2-TZVPP
keywords: def2/J RIJCOSX
keywords: DEFGRID2
keywords: scfconv7
keywords: smallprint printgap noloewdin
keywords: NOSOSCF
formula: C13H16NO4PS
InChI: InChI=1/C13H16NO4PS/c1-3-15-19(20,16-4-2)18-13-10-12(17-14-13)11-8-6-5-7-9-11/h5-10H,3-4H2,1-2H3
36 atoms
S  -2.829695 -0.399798 1.898864
P  -2.506706 -0.139447 0.031643
O  -1.149423 0.701265 -0.350585
O  -3.554392 0.737279 -0.778082
O  -2.318646 -1.405835 -0.899639
O  1.737787 -0.898977 0.504232
N  0.377095 -0.869977 0.42025
C  2.256675 0.247767 0.041721
C  3.704315 0.384554 0.046805
C  0.099795 0.292332 -0.088845
C  1.247708 1.065771 -0.355294
C  -4.330336 1.799151 -0.176628
C  -2.868395 -2.715271 -0.632144
C  4.281858 1.567336 -0.417199
C  4.527123 -0.645973 0.504352
C  5.657881 1.716863 -0.422382
C  5.903956 -0.488932 0.496278
C  -3.504824 3.026354 0.115383
C  -1.808754 -3.753788 -0.884951
C  6.473517 0.68938 0.03427
H  1.30103 2.053906 -0.779377
H  -5.106567 2.016057 -0.90789
H  -4.813374 1.422387 0.726296
H  -3.225077 -2.765432 0.397823
H  -3.723009 -2.848374 -1.294124
H  3.656658 2.374525 -0.776468
H  4.10709 -1.573801 0.868609
H  -4.169346 3.817505 0.463935
H  -2.766877 2.85114 0.898352
H  -2.993338 3.388798 -0.7758
H  -1.433159 -3.707955 -1.907389
H  -0.970395 -3.64703 -0.197875
H  -2.241469 -4.742953 -0.73422
H  6.093946 2.637825 -0.784898
H  6.533175 -1.292812 0.853714
H  7.548774 0.807319 0.030573
elementType: S P O N C H
totalener: -1600.37776566 hartree
nucrepener: 1854.93047659 hartree
electener: -3455.30824225 hartree
oneelecener: -5884.53309051 hartree
twoeener: 2429.22484826 hartree
cpcmener: -0.02736284 hartree
kineticenergy: 1595.28257403 hartree
xcener: -117.834099210185 hartree
chargesum: -0.0000000
charge: -0.434360 0.757223 -0.315722 -0.349249 -0.342558 -0.158553 -0.243608 0.391234 -0.020398 0.340229 -0.299471 0.029513 0.051381 -0.180229 -0.193589 -0.166175 -0.163466 -0.236740 -0.242017 -0.127428 0.175287 0.111383 0.096451 0.085501 0.109748 0.150345 0.149837 0.100368 0.079086 0.091842 0.092461 0.080361 0.095398 0.160975 0.161064 0.163877
qa: -0.4344 0.7572 -0.3157 -0.3492 -0.3426 -0.1586 -0.2436 0.3912 -0.0204 0.3402 -0.2995 0.0295 0.0514 -0.1802 -0.1936 -0.1662 -0.1635 -0.2367 -0.2420 -0.1274 0.1753 0.1114 0.0965 0.0855 0.1097 0.1503 0.1498 0.1004 0.0791 0.0918 0.0925 0.0804 0.0954 0.1610 0.1611 0.1639
va: 1.9947 5.4836 2.1799 2.1181 2.1159 2.2279 2.7699 3.6560 3.6707 4.0710 3.9469 3.8587 3.8357 3.9423 3.9629 3.9135 3.9139 3.8870 3.9362 3.8856 0.9937 0.9919 1.0091 1.0125 0.9938 1.0060 1.0169 1.0085 1.0178 1.0062 1.0034 1.0121 1.0091 0.9926 0.9934 0.9882
dispcorr: -0.014805918 hartree
energy: -1600.392571575910
dipole: -0.27533 0.85421 0.57888 1.04701 0.09604 1.14304 -4.61689 3.39079 -1.22610
magnitude: 1.77340 au
magnitude: 4.50763 debye
