program: Orca
programVersion: 5.0.4
elementType: S P O O O O N C C C C C C C C C C C C C H H H H H H H H H H H H H H H H
charge: 0
multiplicity: 1
keywords: wb97x-d3
keywords: def2-TZVPP
keywords: def2/J RIJCOSX
keywords: DEFGRID2
keywords: scfconv7
keywords: smallprint printgap noloewdin
keywords: NOSOSCF
formula: C13H16NO4PS
InChI: InChI=1/C13H16NO4PS/c1-3-15-19(20,16-4-2)18-13-10-12(17-14-13)11-8-6-5-7-9-11/h5-10H,3-4H2,1-2H3
36 atoms
S  -4.052319 -0.521152 1.050358
P  -2.290633 -0.391003 0.323461
O  -1.210389 -0.116483 1.516413
O  -2.007955 0.743026 -0.752361
O  -1.644964 -1.666123 -0.361912
O  2.082756 0.482555 2.004199
N  0.793806 0.357022 2.427498
C  2.161117 0.272209 0.684321
C  3.468431 0.355275 0.052319
C  0.113786 0.073023 1.356936
C  0.920367 0.003665 0.199777
C  -2.613729 2.056066 -0.679525
C  -2.410694 -2.580997 -1.181116
C  3.569418 0.207674 -1.332224
C  4.624484 0.574327 0.80366
C  4.804555 0.277719 -1.953166
C  5.857688 0.643325 0.174773
C  -3.805388 2.140351 -1.598134
C  -2.826416 -1.978733 -2.49967
C  5.952602 0.495753 -1.202057
H  0.641943 -0.21418 -0.816158
H  -2.888988 2.291786 0.349982
H  -1.831254 2.750063 -0.980544
H  -1.746696 -3.429098 -1.331984
H  -3.275503 -2.925023 -0.611397
H  2.682287 0.039422 -1.929038
H  4.573712 0.688242 1.878197
H  -4.198901 3.156815 -1.576274
H  -3.53164 1.90967 -2.627517
H  -4.601071 1.465171 -1.285451
H  -3.297999 -2.756917 -3.100161
H  -3.553447 -1.174996 -2.379466
H  -1.970727 -1.599315 -3.057314
H  4.870389 0.16277 -3.026747
H  6.748224 0.811697 0.765275
H  6.917265 0.550013 -1.688858
elementType: S P O N C H
totalener: -1600.37823274 hartree
nucrepener: 1872.00410978 hartree
electener: -3472.38234252 hartree
oneelecener: -5917.18526151 hartree
twoeener: 2444.80291898 hartree
cpcmener: -0.02958295 hartree
kineticenergy: 1595.26823261 hartree
xcener: -117.830715879749 hartree
chargesum: 0.0000000
charge: -0.406023 0.696136 -0.310049 -0.326420 -0.326459 -0.146217 -0.218728 0.309580 -0.008328 0.264499 -0.217116 0.052189 0.023969 -0.193317 -0.184685 -0.154122 -0.160562 -0.243473 -0.233912 -0.132825 0.167350 0.096840 0.107803 0.112101 0.098556 0.149560 0.150701 0.102412 0.091823 0.079002 0.102532 0.076937 0.094693 0.161493 0.160845 0.163213
qa: -0.4060 0.6961 -0.3100 -0.3264 -0.3265 -0.1462 -0.2187 0.3096 -0.0083 0.2645 -0.2171 0.0522 0.0240 -0.1933 -0.1847 -0.1541 -0.1606 -0.2435 -0.2339 -0.1328 0.1674 0.0968 0.1078 0.1121 0.0986 0.1496 0.1507 0.1024 0.0918 0.0790 0.1025 0.0769 0.0947 0.1615 0.1608 0.1632
va: 2.0475 5.5193 2.1689 2.0577 2.0982 2.2306 2.8128 3.8358 3.6669 4.2208 3.9239 3.8275 3.8561 3.9530 3.9541 3.9045 3.9110 3.9246 3.8992 3.8925 1.0119 1.0061 0.9963 0.9920 1.0082 1.0073 1.0156 1.0106 1.0025 1.0160 1.0102 1.0112 1.0038 0.9921 0.9932 0.9885
dispcorr: -0.015963939 hartree
energy: -1600.394196680602
dipole: -2.02677 3.06298 1.03621 1.99955 -1.84608 0.15347 -20.74495 17.22827 -3.51668
magnitude: 3.66938 au
magnitude: 9.32682 debye
