program: Orca
programVersion: 5.0.4
elementType: S P O O O O N C C C C C C C C C C C C C H H H H H H H H H H H H H H H H
charge: 0
multiplicity: 1
keywords: wb97x-d3
keywords: def2-TZVPP
keywords: def2/J RIJCOSX
keywords: DEFGRID2
keywords: scfconv7
keywords: smallprint printgap noloewdin
keywords: NOSOSCF
formula: C13H16NO4PS
InChI: InChI=1/C13H16NO4PS/c1-3-15-19(20,16-4-2)18-13-10-12(17-14-13)11-8-6-5-7-9-11/h5-10H,3-4H2,1-2H3
36 atoms
S  -1.607705 -0.459675 2.237258
P  -2.159004 -0.206982 0.425328
O  -1.144403 -0.845766 -0.699588
O  -2.312071 1.310806 0.01536
O  -3.511435 -0.872336 -0.058341
O  2.173944 -1.074903 -1.306179
N  0.879424 -1.464696 -1.476797
C  2.243857 -0.061676 -0.432474
C  3.557958 0.471424 -0.109735
C  0.187784 -0.678593 -0.707353
C  0.990746 0.252605 -0.012782
C  -2.71676 1.75811 -1.308002
C  -3.889893 -2.226836 0.286062
C  3.680417 1.419504 0.907625
C  4.700334 0.044095 -0.789125
C  4.923769 1.929105 1.240347
C  5.941805 0.557708 -0.449293
C  -4.165455 2.169572 -1.313735
C  -5.380326 -2.271272 0.487788
C  6.058509 1.498987 0.56424
H  0.691997 1.024181 0.675473
H  -2.067166 2.602242 -1.531455
H  -2.520616 0.985051 -2.051959
H  -3.574852 -2.878427 -0.528818
H  -3.36656 -2.535572 1.192899
H  2.8050 1.756506 1.447769
H  4.632206 -0.687657 -1.582977
H  -4.831757 1.326088 -1.138191
H  -4.365905 2.937857 -0.567468
H  -4.406554 2.585807 -2.292378
H  -5.674197 -3.293209 0.726743
H  -5.689637 -1.631704 1.314099
H  -5.918582 -1.970872 -0.410956
H  5.007263 2.661414 2.032087
H  6.821767 0.219858 -0.980047
H  7.030166 1.895666 0.826869
elementType: S P O N C H
totalener: -1600.37936810 hartree
nucrepener: 1853.48007483 hartree
electener: -3453.85944293 hartree
oneelecener: -5880.44940163 hartree
twoeener: 2426.58995871 hartree
cpcmener: -0.02792913 hartree
kineticenergy: 1595.26388938 hartree
xcener: -117.827807808625 hartree
chargesum: 0.0000000
charge: -0.415436 0.712459 -0.314999 -0.343583 -0.325824 -0.148814 -0.216536 0.336636 -0.007063 0.295021 -0.244301 0.042163 0.036575 -0.190749 -0.183900 -0.155646 -0.161397 -0.243473 -0.236732 -0.133288 0.156927 0.109085 0.106230 0.110594 0.089371 0.149398 0.151264 0.083146 0.088714 0.096496 0.092778 0.087110 0.091141 0.161573 0.161079 0.163983
qa: -0.4154 0.7125 -0.3150 -0.3436 -0.3258 -0.1488 -0.2165 0.3366 -0.0071 0.2950 -0.2443 0.0422 0.0366 -0.1907 -0.1839 -0.1556 -0.1614 -0.2435 -0.2367 -0.1333 0.1569 0.1091 0.1062 0.1106 0.0894 0.1494 0.1513 0.0831 0.0887 0.0965 0.0928 0.0871 0.0911 0.1616 0.1611 0.1640
va: 2.0291 5.5209 2.1201 2.1029 2.1236 2.2312 2.8041 3.7720 3.6663 4.1418 3.9444 3.8409 3.8268 3.9542 3.9529 3.9086 3.9115 3.9389 3.9459 3.8934 1.0146 0.9931 0.9986 0.9956 1.0115 1.0059 1.0153 1.0122 1.0036 1.0069 1.0076 1.0066 1.0033 0.9920 0.9931 0.9882
dispcorr: -0.015204973 hartree
energy: -1600.394573069348
dipole: -12.35735 11.87677 -0.48058 4.94393 -3.65092 1.29301 -3.57582 2.94065 -0.63517
magnitude: 1.51864 au
magnitude: 3.86008 debye
