program: Orca
programVersion: 5.0.4
elementType: S P O O O O N C C C C C C C C C C C C C H H H H H H H H H H H H H H H H
charge: 0
multiplicity: 1
keywords: wb97x-d3
keywords: def2-TZVPP
keywords: def2/J RIJCOSX
keywords: DEFGRID2
keywords: scfconv7
keywords: smallprint printgap noloewdin
keywords: NOSOSCF
formula: C13H16NO4PS
InChI: InChI=1/C13H16NO4PS/c1-3-15-19(20,16-4-2)18-13-10-12(17-14-13)11-8-6-5-7-9-11/h5-10H,3-4H2,1-2H3
36 atoms
S  -1.738112 0.564377 1.879292
P  -2.265138 -0.102122 0.16732
O  -1.136176 0.091474 -1.013696
O  -3.503899 0.548406 -0.57477
O  -2.591625 -1.649599 0.179692
O  1.969525 -1.262761 -0.751723
N  0.641505 -1.358151 -1.028401
C  2.275463 -0.01989 -0.345465
C  3.661044 0.268927 -0.013153
C  0.166104 -0.173776 -0.786153
C  1.145774 0.734882 -0.344085
C  -3.764613 1.974496 -0.534391
C  -2.981596 -2.408417 -0.995128
C  4.002835 1.54722 0.432472
C  4.656156 -0.702916 -0.133911
C  5.316181 1.848164 0.748705
C  5.969127 -0.393777 0.183774
C  -4.881572 2.27123 0.432176
C  -3.160952 -3.842646 -0.57512
C  6.304041 0.87921 0.624234
H  1.018044 1.770211 -0.078739
H  -2.857258 2.521041 -0.268355
H  -4.032229 2.251497 -1.553365
H  -3.910033 -1.99951 -1.395576
H  -2.205786 -2.3197 -1.7572
H  3.242134 2.310821 0.533154
H  4.41747 -1.700849 -0.476773
H  -5.099131 3.338868 0.40825
H  -5.793853 1.737403 0.166065
H  -4.606208 2.007665 1.453396
H  -3.472626 -4.426117 -1.441382
H  -2.23208 -4.271258 -0.198475
H  -3.931262 -3.942721 0.190025
H  5.568693 2.84208 1.093214
H  6.733715 -1.152715 0.08468
H  7.330824 1.116246 0.869412
elementType: S P O N C H
totalener: -1600.37926912 hartree
nucrepener: 1851.74656240 hartree
electener: -3452.12583152 hartree
oneelecener: -5877.65058280 hartree
twoeener: 2425.52475128 hartree
cpcmener: -0.02770415 hartree
kineticenergy: 1595.25848552 hartree
xcener: -117.823722666796 hartree
chargesum: -0.0000000
charge: -0.421989 0.729035 -0.344836 -0.340310 -0.339631 -0.146916 -0.210024 0.405062 -0.014488 0.286768 -0.282524 0.044438 0.019339 -0.186640 -0.191632 -0.158242 -0.160001 -0.231847 -0.240054 -0.129950 0.172959 0.093544 0.110213 0.114256 0.108546 0.150490 0.150351 0.095670 0.091218 0.074764 0.089863 0.088733 0.088920 0.161101 0.160654 0.163161
qa: -0.4220 0.7290 -0.3448 -0.3403 -0.3396 -0.1469 -0.2100 0.4051 -0.0145 0.2868 -0.2825 0.0444 0.0193 -0.1866 -0.1916 -0.1582 -0.1600 -0.2318 -0.2401 -0.1299 0.1730 0.0935 0.1102 0.1143 0.1085 0.1505 0.1504 0.0957 0.0912 0.0748 0.0899 0.0887 0.0889 0.1611 0.1607 0.1632
va: 2.0157 5.5162 2.0890 2.0957 2.1403 2.2293 2.7934 3.6241 3.6764 4.1140 3.9813 3.8443 3.8404 3.9466 3.9605 3.9090 3.9100 3.9303 3.9548 3.8902 0.9974 1.0039 0.9958 0.9960 0.9966 1.0056 1.0160 1.0079 1.0040 1.0174 1.0059 1.0052 1.0043 0.9923 0.9933 0.9884
dispcorr: -0.014997259 hartree
energy: -1600.394266378303
dipole: -7.84108 7.91532 0.07424 0.85937 0.54665 1.40602 -2.39359 1.26701 -1.12658
magnitude: 1.80322 au
magnitude: 4.58341 debye
