program: Orca
programVersion: 5.0.4
elementType: S P O O O O N C C C C C C C C C C C C C H H H H H H H H H H H H H H H H
charge: 0
multiplicity: 1
keywords: wb97x-d3
keywords: def2-TZVPP
keywords: def2/J RIJCOSX
keywords: DEFGRID2
keywords: scfconv7
keywords: smallprint printgap noloewdin
keywords: NOSOSCF
formula: C13H16NO4PS
InChI: InChI=1/C13H16NO4PS/c1-3-15-19(20,16-4-2)18-13-10-12(17-14-13)11-8-6-5-7-9-11/h5-10H,3-4H2,1-2H3
36 atoms
S  -1.806081 -0.681377 1.848757
P  -2.353514 -0.502488 0.021916
O  -1.166534 -0.764417 -1.085202
O  -2.969368 0.882809 -0.435725
O  -3.440172 -1.499711 -0.549795
O  1.660025 1.065813 -1.510968
N  0.377084 0.746113 -1.830393
C  2.08706 0.315945 -0.48255
C  3.443747 0.516672 0.000121
C  0.048622 -0.18946 -0.991141
C  1.088274 -0.52089 -0.100698
C  -3.020465 2.058698 0.406158
C  -3.3273 -2.933878 -0.384511
C  3.909172 -0.2639 1.060348
C  4.287025 1.473109 -0.568021
C  5.194107 -0.089886 1.544119
C  5.572509 1.642021 -0.077533
C  -1.736729 2.843585 0.338106
C  -4.682368 -3.490597 -0.037941
C  6.029463 0.864807 0.97797
H  1.083234 -1.259581 0.681222
H  -3.858641 2.637151 0.023063
H  -3.252674 1.765429 1.430585
H  -2.954612 -3.342869 -1.323148
H  -2.604253 -3.167277 0.39952
H  3.267676 -1.01013 1.510937
H  3.950776 2.089609 -1.39101
H  -1.50716 3.148926 -0.681973
H  -1.84321 3.744956 0.94219
H  -0.89369 2.276148 0.734495
H  -5.416874 -3.276494 -0.814122
H  -4.605466 -4.573547 0.058749
H  -5.045781 -3.093631 0.909706
H  5.543283 -0.700106 2.366228
H  6.219055 2.386028 -0.523229
H  7.032992 1.001683 1.358285
elementType: S P O N C H
totalener: -1600.37776644 hartree
nucrepener: 1872.21726986 hartree
electener: -3472.59503630 hartree
oneelecener: -5918.33520013 hartree
twoeener: 2445.74016383 hartree
cpcmener: -0.02599179 hartree
kineticenergy: 1595.27826087 hartree
xcener: -117.830658756539 hartree
chargesum: -0.0000000
charge: -0.430350 0.734046 -0.329111 -0.344188 -0.342851 -0.148200 -0.196204 0.376829 -0.009496 0.247784 -0.248517 0.054730 0.046004 -0.190989 -0.193088 -0.153610 -0.157132 -0.241983 -0.231803 -0.134317 0.166739 0.113802 0.093734 0.107220 0.087321 0.151064 0.150315 0.089326 0.106077 0.074690 0.090373 0.090789 0.084008 0.161699 0.161324 0.163966
qa: -0.4304 0.7340 -0.3291 -0.3442 -0.3429 -0.1482 -0.1962 0.3768 -0.0095 0.2478 -0.2485 0.0547 0.0460 -0.1910 -0.1931 -0.1536 -0.1571 -0.2420 -0.2318 -0.1343 0.1667 0.1138 0.0937 0.1072 0.0873 0.1511 0.1503 0.0893 0.1061 0.0747 0.0904 0.0908 0.0840 0.1617 0.1613 0.1640
va: 1.9897 5.5196 2.1158 2.1163 2.1337 2.2298 2.7944 3.6889 3.6659 4.1481 3.9676 3.8237 3.8320 3.9478 3.9602 3.9065 3.9079 3.9042 3.9498 3.8936 1.0033 0.9935 1.0138 0.9970 1.0103 1.0049 1.0156 1.0100 1.0104 1.0117 1.0039 1.0072 1.0082 0.9921 0.9930 0.9883
dispcorr: -0.015711566 hartree
energy: -1600.393478001646
dipole: -2.59631 3.30785 0.71154 -0.52017 -0.09206 -0.61223 5.06008 -3.96760 1.09248
magnitude: 1.44036 au
magnitude: 3.66109 debye
