program: Orca
programVersion: 5.0.4
elementType: S P O O O O N C C C C C C C C C C C C C H H H H H H H H H H H H H H H H
charge: 0
multiplicity: 1
keywords: wb97x-d3
keywords: def2-TZVPP
keywords: def2/J RIJCOSX
keywords: DEFGRID2
keywords: scfconv7
keywords: smallprint printgap noloewdin
keywords: NOSOSCF
formula: C13H16NO4PS
InChI: InChI=1/C13H16NO4PS/c1-3-15-19(20,16-4-2)18-13-10-12(17-14-13)11-8-6-5-7-9-11/h5-10H,3-4H2,1-2H3
36 atoms
S  -1.769514 -0.905816 1.825376
P  -2.384056 -0.511155 0.054953
O  -1.221613 -0.525025 -1.104424
O  -3.141195 0.858609 -0.187882
O  -3.417823 -1.500291 -0.622465
O  1.625019 1.305305 -1.344234
N  0.326473 1.053666 -1.663316
C  2.066541 0.414243 -0.442078
C  3.439789 0.52986 0.023992
C  0.003894 0.014492 -0.953044
C  1.06167 -0.450961 -0.147006
C  -3.164165 1.946748 0.764834
C  -3.127179 -2.911011 -0.764874
C  4.284925 1.542182 -0.434197
C  3.919197 -0.388933 0.959765
C  5.582798 1.632332 0.044721
C  5.216083 -0.292219 1.433682
C  -1.915739 2.787677 0.692807
C  -4.422551 -3.673433 -0.704484
C  6.051771 0.720265 0.980174
H  1.067931 -1.291107 0.524834
H  -4.044475 2.527238 0.49626
H  -3.315741 1.547482 1.768374
H  -2.622775 -3.057145 -1.720412
H  -2.452127 -3.234138 0.030645
H  3.94028 2.267609 -1.158994
H  3.278522 -1.18152 1.32407
H  -1.758834 3.191882 -0.30682
H  -2.019023 3.627699 1.380627
H  -1.029084 2.225475 0.988695
H  -5.106279 -3.369173 -1.496705
H  -4.213512 -4.735086 -0.833347
H  -4.917474 -3.542388 0.257307
H  6.229622 2.421361 -0.314943
H  5.574975 -1.009331 2.159705
H  7.064979 0.795344 1.352428
elementType: S P O N C H
totalener: -1600.37822601 hartree
nucrepener: 1868.97308106 hartree
electener: -3469.35130707 hartree
oneelecener: -5911.75879190 hartree
twoeener: 2442.40748483 hartree
cpcmener: -0.02605372 hartree
kineticenergy: 1595.26651936 hartree
xcener: -117.828820718038 hartree
chargesum: 0.0000000
charge: -0.429387 0.729343 -0.329903 -0.342325 -0.340505 -0.148093 -0.197568 0.374353 -0.009372 0.251763 -0.245778 0.052695 0.042278 -0.193391 -0.189524 -0.155780 -0.153061 -0.242176 -0.236336 -0.134780 0.168187 0.113228 0.094936 0.107856 0.090631 0.149994 0.150466 0.089538 0.106108 0.074805 0.090270 0.090058 0.085808 0.161004 0.161031 0.163629
qa: -0.4294 0.7293 -0.3299 -0.3423 -0.3405 -0.1481 -0.1976 0.3744 -0.0094 0.2518 -0.2458 0.0527 0.0423 -0.1934 -0.1895 -0.1558 -0.1531 -0.2422 -0.2363 -0.1348 0.1682 0.1132 0.0949 0.1079 0.0906 0.1500 0.1505 0.0895 0.1061 0.0748 0.0903 0.0901 0.0858 0.1610 0.1610 0.1636
va: 1.9922 5.5246 2.1105 2.1184 2.1356 2.2292 2.7918 3.6942 3.6625 4.1365 3.9694 3.8267 3.8326 3.9598 3.9463 3.9066 3.9057 3.9014 3.9553 3.8930 1.0023 0.9932 1.0127 0.9963 1.0072 1.0156 1.0051 1.0104 1.0103 1.0117 1.0036 1.0065 1.0071 0.9930 0.9923 0.9883
dispcorr: -0.015622072 hartree
energy: -1600.393848081354
dipole: -1.93339 2.78680 0.85341 -1.77781 1.01371 -0.76410 3.71275 -2.85659 0.85616
magnitude: 1.43010 au
magnitude: 3.63501 debye
