program: Orca
programVersion: 5.0.4
elementType: S P O O O O N C C C C C C C C C C C C C H H H H H H H H H H H H H H H H
charge: 0
multiplicity: 1
keywords: wb97x-d3
keywords: def2-TZVPP
keywords: def2/J RIJCOSX
keywords: DEFGRID2
keywords: scfconv7
keywords: smallprint printgap noloewdin
keywords: NOSOSCF
formula: C13H16NO4PS
InChI: InChI=1/C13H16NO4PS/c1-3-15-19(20,16-4-2)18-13-10-12(17-14-13)11-8-6-5-7-9-11/h5-10H,3-4H2,1-2H3
36 atoms
S  -1.999906 0.773521 2.127891
P  -2.155852 -0.219471 0.502961
O  -1.051219 -1.402388 0.267215
O  -1.947619 0.570901 -0.861526
O  -3.489465 -1.06174 0.413806
O  2.268165 -1.678633 -0.323503
N  1.003318 -2.181525 -0.247771
C  2.270132 -0.374593 -0.018465
C  3.54002 0.333413 -0.038982
C  0.263338 -1.173027 0.10234
C  1.002109 0.018625 0.268285
C  -2.467463 1.90043 -1.085124
C  -3.834115 -1.903988 -0.719919
C  3.57661 1.68221 0.319659
C  4.723247 -0.310753 -0.404452
C  4.776288 2.37261 0.31554
C  5.920462 0.387388 -0.406936
C  -3.966809 1.91162 -1.248541
C  -5.332496 -1.922043 -0.859891
C  5.952159 1.727421 -0.046361
H  0.658848 0.996629 0.558124
H  -2.150434 2.549532 -0.266976
H  -1.973659 2.237245 -1.994236
H  -3.367453 -1.52643 -1.6304
H  -3.442337 -2.90168 -0.522093
H  2.667869 2.195846 0.60644
H  4.721046 -1.354752 -0.687704
H  -4.289789 1.231433 -2.036803
H  -4.486231 1.653398 -0.325337
H  -4.279906 2.91764 -1.52874
H  -5.817714 -2.297532 0.040689
H  -5.727407 -0.931621 -1.08573
H  -5.599539 -2.585006 -1.682977
H  4.79317 3.416966 0.596876
H  6.832534 -0.120166 -0.691019
H  6.889137 2.268287 -0.047423
elementType: S P O N C H
totalener: -1600.37985699 hartree
nucrepener: 1864.55258199 hartree
electener: -3464.93243898 hartree
oneelecener: -5902.41937639 hartree
twoeener: 2437.48693741 hartree
cpcmener: -0.02967227 hartree
kineticenergy: 1595.26744285 hartree
xcener: -117.829290218707 hartree
chargesum: -0.0000000
charge: -0.416403 0.709594 -0.311756 -0.329542 -0.339774 -0.148118 -0.212915 0.326642 -0.009981 0.286184 -0.236634 0.039837 0.016713 -0.195092 -0.185891 -0.152906 -0.160075 -0.249671 -0.240511 -0.132879 0.153015 0.097923 0.112186 0.116221 0.117679 0.150644 0.151346 0.091928 0.086518 0.108189 0.091762 0.086570 0.093315 0.161453 0.160999 0.163427
qa: -0.4164 0.7096 -0.3118 -0.3295 -0.3398 -0.1481 -0.2129 0.3266 -0.0100 0.2862 -0.2366 0.0398 0.0167 -0.1951 -0.1859 -0.1529 -0.1601 -0.2497 -0.2405 -0.1329 0.1530 0.0979 0.1122 0.1162 0.1177 0.1506 0.1513 0.0919 0.0865 0.1082 0.0918 0.0866 0.0933 0.1615 0.1610 0.1634
va: 2.0279 5.5254 2.1671 2.0581 2.1234 2.2335 2.8108 3.8232 3.6719 4.1711 3.9616 3.8290 3.8271 3.9565 3.9544 3.9041 3.9101 3.9171 3.9474 3.8927 1.0117 1.0101 0.9907 0.9957 0.9964 1.0046 1.0156 1.0022 1.0121 1.0106 1.0030 1.0050 1.0062 0.9921 0.9931 0.9884
dispcorr: -0.016002386 hartree
energy: -1600.395859374290
dipole: -11.66319 11.30457 -0.35863 7.65269 -5.81229 1.84040 -11.25892 9.32632 -1.93260
magnitude: 2.69270 au
magnitude: 6.84430 debye
