program: Orca
programVersion: 5.0.4
elementType: S P O O O O N C C C C C C C C C C C C C H H H H H H H H H H H H H H H H
charge: 0
multiplicity: 1
keywords: wb97x-d3
keywords: def2-TZVPP
keywords: def2/J RIJCOSX
keywords: DEFGRID2
keywords: scfconv7
keywords: smallprint printgap noloewdin
keywords: NOSOSCF
formula: C13H16NO4PS
InChI: InChI=1/C13H16NO4PS/c1-3-15-19(20,16-4-2)18-13-10-12(17-14-13)11-8-6-5-7-9-11/h5-10H,3-4H2,1-2H3
36 atoms
S  -3.767638 -0.021101 2.076657
P  -2.552164 -0.039193 0.602681
O  -1.025616 0.038868 1.213788
O  -2.613318 1.192639 -0.384142
O  -2.571384 -1.295066 -0.367748
O  1.444862 0.134125 -1.136424
N  0.127671 0.042277 -0.803767
C  2.196694 0.234513 -0.033779
C  3.63824 0.335692 -0.205208
C  0.102452 0.095464 0.493755
C  1.389563 0.218068 1.058811
C  -2.738637 1.166151 -1.826753
C  -2.845339 -2.640962 0.078135
C  4.455748 0.504211 0.91388
C  4.219974 0.264884 -1.472564
C  5.828622 0.602409 0.766627
C  5.595137 0.361486 -1.611912
C  -2.305745 2.509614 -2.350101
C  -1.6823 -3.250278 0.819948
C  6.402851 0.531402 -0.496178
H  1.652515 0.280122 2.100992
H  -2.117636 0.37605 -2.24443
H  -3.78132 0.959979 -2.074195
H  -3.750279 -2.639561 0.68871
H  -3.056408 -3.192482 -0.836303
H  4.022016 0.560306 1.904237
H  3.610425 0.130387 -2.356208
H  -2.414382 2.517525 -3.435225
H  -2.914814 3.319605 -1.948263
H  -1.25875 2.707571 -2.117136
H  -1.905578 -4.299249 1.018941
H  -0.765585 -3.210831 0.231363
H  -1.505342 -2.767994 1.781643
H  6.452026 0.734069 1.641138
H  6.035887 0.305397 -2.598549
H  7.476288 0.609534 -0.609951
elementType: S P O N C H
totalener: -1600.38647372 hartree
nucrepener: 1871.77960606 hartree
electener: -3472.16607979 hartree
oneelecener: -5917.47744495 hartree
twoeener: 2445.31136516 hartree
cpcmener: -0.02276878 hartree
kineticenergy: 1595.26443723 hartree
xcener: -117.830447312891 hartree
chargesum: -0.0000000
charge: -0.412362 0.680970 -0.306958 -0.335576 -0.307140 -0.156452 -0.242430 0.388699 -0.018250 0.343829 -0.298814 0.022343 0.027262 -0.179161 -0.192572 -0.163889 -0.159329 -0.238063 -0.244798 -0.123743 0.171123 0.105814 0.121323 0.096534 0.106603 0.146584 0.147866 0.088706 0.090485 0.084338 0.105135 0.090853 0.085970 0.157654 0.157138 0.160306
qa: -0.4124 0.6810 -0.3070 -0.3356 -0.3071 -0.1565 -0.2424 0.3887 -0.0182 0.3438 -0.2988 0.0223 0.0273 -0.1792 -0.1926 -0.1639 -0.1593 -0.2381 -0.2448 -0.1237 0.1711 0.1058 0.1213 0.0965 0.1066 0.1466 0.1479 0.0887 0.0905 0.0843 0.1051 0.0909 0.0860 0.1577 0.1571 0.1603
va: 2.0638 5.5453 2.1438 2.1089 2.0737 2.2348 2.7247 3.6551 3.6861 4.0440 3.9451 3.8205 3.8634 3.9500 3.9696 3.9205 3.9203 3.9478 3.8936 3.8926 0.9963 1.0028 0.9948 1.0108 0.9909 1.0071 1.0179 1.0073 1.0035 1.0083 1.0102 1.0068 1.0153 0.9937 0.9946 0.9893
dispcorr: -0.015816727 hartree
energy: -1600.402290451495
dipole: 6.70769 -4.59237 2.11531 -3.68353 2.86882 -0.81471 -9.27326 8.24293 -1.03033
magnitude: 2.48996 au
magnitude: 6.32897 debye
