program: Orca
programVersion: 5.0.4
elementType: S P O O O O N C C C C C C C C C C C C C H H H H H H H H H H H H H H H H
charge: 0
multiplicity: 1
keywords: wb97x-d3
keywords: def2-TZVPP
keywords: def2/J RIJCOSX
keywords: DEFGRID2
keywords: scfconv7
keywords: smallprint printgap noloewdin
keywords: NOSOSCF
formula: C13H16NO4PS
InChI: InChI=1/C13H16NO4PS/c1-3-15-19(20,16-4-2)18-13-10-12(17-14-13)11-8-6-5-7-9-11/h5-10H,3-4H2,1-2H3
36 atoms
S  -1.992604 -0.258068 2.357256
P  -2.411621 -0.681797 0.538556
O  -1.173091 -1.34857 -0.307757
O  -2.872062 0.505883 -0.411004
O  -3.484051 -1.827465 0.365232
O  1.482645 0.413435 -1.473843
N  0.214206 -0.058472 -1.591046
C  2.011224 0.049765 -0.297914
C  3.380246 0.448723 -0.010661
C  -0.006502 -0.701955 -0.484562
C  1.093202 -0.673287 0.395858
C  -2.985195 1.888621 -0.001879
C  -4.357189 -2.023258 -0.773383
C  4.156624 1.120883 -0.956324
C  3.933381 0.140754 1.233699
C  5.463718 1.47149 -0.657614
C  5.23964 0.493555 1.524641
C  -1.704632 2.644786 -0.244109
C  -3.63442 -2.416509 -2.037722
C  6.009564 1.159649 0.579765
H  1.176675 -1.130883 1.366332
H  -3.801137 2.293557 -0.598779
H  -3.279335 1.938445 1.047572
H  -5.027118 -2.819545 -0.453708
H  -4.957937 -1.124723 -0.922568
H  3.753734 1.369925 -1.929201
H  3.343226 -0.376372 1.979581
H  -1.398208 2.595651 -1.288843
H  -1.864069 3.694394 0.008157
H  -0.890133 2.274352 0.379436
H  -3.046629 -1.600875 -2.458594
H  -2.984767 -3.277772 -1.881772
H  -4.380898 -2.698102 -2.782006
H  6.058737 1.989622 -1.3982
H  5.657194 0.247622 2.492162
H  7.031428 1.434094 0.80735
elementType: S P O N C H
totalener: -1600.38538065 hartree
nucrepener: 1887.19449873 hartree
electener: -3487.57987938 hartree
oneelecener: -5948.32131210 hartree
twoeener: 2460.74143273 hartree
cpcmener: -0.02307030 hartree
kineticenergy: 1595.25866038 hartree
xcener: -117.827617690497 hartree
chargesum: -0.0000000
charge: -0.420484 0.701298 -0.326348 -0.327754 -0.340171 -0.144381 -0.196970 0.381323 -0.007046 0.264762 -0.260472 0.050439 0.034535 -0.191719 -0.186007 -0.152908 -0.153124 -0.234481 -0.247438 -0.130811 0.165410 0.107485 0.091543 0.109308 0.099572 0.148389 0.146934 0.088984 0.104719 0.074347 0.084499 0.090330 0.100714 0.157595 0.158217 0.159708
qa: -0.4205 0.7013 -0.3263 -0.3278 -0.3402 -0.1444 -0.1970 0.3813 -0.0070 0.2648 -0.2605 0.0504 0.0345 -0.1917 -0.1860 -0.1529 -0.1531 -0.2345 -0.2474 -0.1308 0.1654 0.1075 0.0915 0.1093 0.0996 0.1484 0.1469 0.0890 0.1047 0.0743 0.0845 0.0903 0.1007 0.1576 0.1582 0.1597
va: 2.0256 5.5230 2.1128 2.0739 2.1423 2.2410 2.7904 3.6647 3.6746 4.1106 3.9984 3.8373 3.8654 3.9672 3.9554 3.9123 3.9149 3.9050 3.9004 3.8999 1.0043 0.9918 1.0141 0.9877 0.9980 1.0165 1.0061 1.0101 1.0110 1.0137 1.0168 1.0058 1.0087 0.9941 0.9933 0.9898
dispcorr: -0.016660296 hartree
energy: -1600.402040944372
dipole: -1.58732 1.80965 0.22233 5.91670 -5.35052 0.56618 -6.51481 6.11643 -0.39838
magnitude: 0.72711 au
magnitude: 1.84817 debye
