program: Orca
programVersion: 5.0.4
elementType: S P O O O O N C C C C C C C C C C C C C H H H H H H H H H H H H H H H H
charge: 0
multiplicity: 1
keywords: wb97x-d3
keywords: def2-TZVPP
keywords: def2/J RIJCOSX
keywords: DEFGRID2
keywords: scfconv7
keywords: smallprint printgap noloewdin
keywords: NOSOSCF
formula: C13H16NO4PS
InChI: InChI=1/C13H16NO4PS/c1-3-15-19(20,16-4-2)18-13-10-12(17-14-13)11-8-6-5-7-9-11/h5-10H,3-4H2,1-2H3
36 atoms
S  -2.044364 -1.951566 1.362565
P  -2.283788 -0.556063 0.080391
O  -0.93537 -0.174286 -0.787751
O  -2.781367 0.804705 0.705701
O  -3.260095 -0.798321 -1.144872
O  1.643668 0.92174 1.145832
N  0.314465 0.707582 0.949461
C  2.342503 0.519699 0.077407
C  3.788056 0.67618 0.10875
C  0.231779 0.172082 -0.230931
C  1.487423 0.022285 -0.853616
C  -3.054927 2.011056 -0.046499
C  -3.468344 -2.098018 -1.740747
C  4.531422 0.401653 -1.040327
C  4.446643 1.095213 1.266315
C  5.908193 0.543272 -1.031384
C  5.825282 1.23393 1.268023
C  -4.541387 2.243903 -0.137089
C  -4.732871 -2.725082 -1.212694
C  6.559662 0.959372 0.12266
H  1.700211 -0.397779 -1.822012
H  -2.562748 2.813019 0.50231
H  -2.601987 1.965135 -1.038508
H  -3.531666 -1.919312 -2.813371
H  -2.605262 -2.742267 -1.561546
H  4.034772 0.082214 -1.947731
H  3.892406 1.309828 2.17055
H  -4.998206 2.295217 0.851734
H  -4.721837 3.196213 -0.637348
H  -5.039842 1.463779 -0.712531
H  -4.66151 -2.930529 -0.144424
H  -5.599904 -2.087512 -1.390197
H  -4.903954 -3.672166 -1.726284
H  6.473954 0.329781 -1.928754
H  6.327306 1.557703 2.170305
H  7.636144 1.070177 0.128027
elementType: S P O N C H
totalener: -1600.38753666 hartree
nucrepener: 1845.80551872 hartree
electener: -3446.19305538 hartree
oneelecener: -5865.84592087 hartree
twoeener: 2419.65286548 hartree
cpcmener: -0.02710648 hartree
kineticenergy: 1595.28349594 hartree
xcener: -117.831370766147 hartree
chargesum: 0.0000000
charge: -0.412803 0.714444 -0.321633 -0.330963 -0.327135 -0.151049 -0.227759 0.385847 -0.014666 0.322111 -0.289971 0.040658 0.030868 -0.180323 -0.190236 -0.164880 -0.160015 -0.243946 -0.230569 -0.124316 0.171327 0.105770 0.102195 0.107896 0.092158 0.146668 0.147817 0.090053 0.093533 0.082410 0.077222 0.089615 0.094210 0.157465 0.157511 0.160486
qa: -0.4128 0.7144 -0.3216 -0.3310 -0.3271 -0.1510 -0.2278 0.3858 -0.0147 0.3221 -0.2900 0.0407 0.0309 -0.1803 -0.1902 -0.1649 -0.1600 -0.2439 -0.2306 -0.1243 0.1713 0.1058 0.1022 0.1079 0.0922 0.1467 0.1478 0.0901 0.0935 0.0824 0.0772 0.0896 0.0942 0.1575 0.1575 0.1605
va: 2.0300 5.5149 2.1292 2.1108 2.0946 2.2377 2.7496 3.6604 3.6776 4.0711 3.9599 3.8448 3.8516 3.9503 3.9672 3.9234 3.9203 3.9458 3.9251 3.8924 0.9944 0.9949 0.9980 0.9954 1.0080 1.0067 1.0173 1.0032 1.0072 1.0120 1.0200 1.0041 1.0086 0.9938 0.9943 0.9893
dispcorr: -0.014997449 hartree
energy: -1600.402534110261
dipole: -8.61394 9.29181 0.67786 2.52021 -1.90151 0.61870 -9.70022 6.98037 -2.71985
magnitude: 2.87052 au
magnitude: 7.29627 debye
