program: Orca
programVersion: 5.0.4
elementType: S P O O O O N C C C C C C C C C C C C C H H H H H H H H H H H H H H H H
charge: 0
multiplicity: 1
keywords: wb97x-d3
keywords: def2-TZVPP
keywords: def2/J RIJCOSX
keywords: DEFGRID2
keywords: scfconv7
keywords: smallprint printgap noloewdin
keywords: NOSOSCF
formula: C13H16NO4PS
InChI: InChI=1/C13H16NO4PS/c1-3-15-19(20,16-4-2)18-13-10-12(17-14-13)11-8-6-5-7-9-11/h5-10H,3-4H2,1-2H3
36 atoms
S  -1.897649 -0.131696 1.966046
P  -2.33622 0.325467 0.156887
O  -1.215582 1.1803 -0.669445
O  -3.500527 1.369759 -0.09777
O  -2.657356 -0.878454 -0.828533
O  1.827761 0.034388 -1.635707
N  0.512842 0.284278 -1.866574
C  2.157887 0.375207 -0.383142
C  3.539181 0.192223 0.035838
C  0.06538 0.772821 -0.749801
C  1.057272 0.8621 0.247252
C  -4.679011 1.427512 0.7319
C  -2.477662 -2.276568 -0.520917
C  4.517806 -0.24854 -0.856954
C  3.894988 0.471393 1.356776
C  5.82729 -0.403216 -0.429791
C  5.204874 0.315643 1.775771
C  -5.584755 0.23635 0.542392
C  -1.085496 -2.751475 -0.849732
C  6.175437 -0.122612 0.884025
H  0.958697 1.240399 1.24966
H  -4.377144 1.534938 1.775747
H  -5.177771 2.34692 0.431095
H  -2.716577 -2.455649 0.528559
H  -3.220658 -2.792139 -1.127507
H  4.270038 -0.470593 -1.886643
H  3.147905 0.80836 2.064114
H  -6.503723 0.403142 1.105737
H  -5.85556 0.099254 -0.504734
H  -5.13934 -0.687697 0.913515
H  -0.831661 -2.566005 -1.893304
H  -0.334252 -2.278572 -0.215792
H  -1.032204 -3.827548 -0.678865
H  6.579394 -0.743234 -1.129642
H  5.467995 0.535959 2.80204
H  7.199882 -0.24197 1.211999
elementType: S P O N C H
totalener: -1600.38636598 hartree
nucrepener: 1881.27381811 hartree
electener: -3481.66018409 hartree
oneelecener: -5936.38918423 hartree
twoeener: 2454.72900014 hartree
cpcmener: -0.02272193 hartree
kineticenergy: 1595.28010583 hartree
xcener: -117.832708088401 hartree
chargesum: -0.0000000
charge: -0.427842 0.717576 -0.320775 -0.333879 -0.332470 -0.141349 -0.187055 0.373696 -0.007570 0.231294 -0.255019 0.030910 0.052843 -0.188504 -0.185749 -0.153007 -0.151424 -0.238375 -0.236402 -0.131592 0.165580 0.095515 0.110596 0.092147 0.111613 0.147135 0.146605 0.099045 0.093459 0.079653 0.089657 0.074200 0.104329 0.157454 0.157350 0.160351
qa: -0.4278 0.7176 -0.3208 -0.3339 -0.3325 -0.1413 -0.1871 0.3737 -0.0076 0.2313 -0.2550 0.0309 0.0528 -0.1885 -0.1857 -0.1530 -0.1514 -0.2384 -0.2364 -0.1316 0.1656 0.0955 0.1106 0.0921 0.1116 0.1471 0.1466 0.0990 0.0935 0.0797 0.0897 0.0742 0.1043 0.1575 0.1573 0.1604
va: 1.9948 5.5347 2.1573 2.1307 2.0944 2.2377 2.7997 3.6814 3.6721 4.1723 3.9733 3.8587 3.8209 3.9656 3.9532 3.9115 3.9146 3.8949 3.9230 3.8998 1.0030 1.0096 0.9915 1.0121 0.9917 1.0168 1.0058 1.0087 1.0060 1.0120 1.0102 1.0104 1.0108 0.9943 0.9936 0.9896
dispcorr: -0.016424240 hartree
energy: -1600.402790220138
dipole: -5.08810 5.09574 0.00764 -9.43226 8.79800 -0.63426 3.37396 -2.22404 1.14992
magnitude: 1.31326 au
magnitude: 3.33805 debye
