program: Orca
programVersion: 5.0.4
elementType: S P O O O O N C C C C C C C C C C C C C H H H H H H H H H H H H H H H H
charge: 0
multiplicity: 1
keywords: wb97x-d3
keywords: def2-TZVPP
keywords: def2/J RIJCOSX
keywords: DEFGRID2
keywords: scfconv7
keywords: smallprint printgap noloewdin
keywords: NOSOSCF
formula: C13H16NO4PS
InChI: InChI=1/C13H16NO4PS/c1-3-15-19(20,16-4-2)18-13-10-12(17-14-13)11-8-6-5-7-9-11/h5-10H,3-4H2,1-2H3
36 atoms
S  -4.181612 -0.351489 0.704835
P  -2.373441 -0.392126 0.087487
O  -1.355142 0.125892 1.246592
O  -2.027582 0.474755 -1.201121
O  -1.706217 -1.787993 -0.25071
O  1.889203 0.874854 1.813833
N  0.582242 0.787239 2.176603
C  2.053307 0.450359 0.557379
C  3.397223 0.4775 -0.000163
C  -0.028134 0.309425 1.134248
C  0.850108 0.067654 0.053569
C  -2.693179 1.718648 -1.506377
C  -2.320987 -2.735865 -1.155153
C  4.49495 0.851152 0.777764
C  3.595091 0.127459 -1.336975
C  5.764047 0.875589 0.221844
C  4.865939 0.153367 -1.885323
C  -2.28941 2.8348 -0.575206
C  -3.017275 -3.830653 -0.388138
C  5.954501 0.528868 -1.108486
H  0.63596 -0.326995 -0.924105
H  -2.402132 1.94025 -2.531593
H  -3.773157 1.559779 -1.488495
H  -3.011466 -2.229496 -1.83346
H  -1.503593 -3.132575 -1.755915
H  4.370326 1.123398 1.817497
H  2.755171 -0.162764 -1.955175
H  -1.20787 2.971624 -0.555027
H  -2.736518 3.764866 -0.928144
H  -2.642229 2.671539 0.443806
H  -3.867029 -3.448277 0.176728
H  -3.38944 -4.57591 -1.092183
H  -2.336172 -4.3319 0.300048
H  6.607912 1.167814 0.832949
H  5.006672 -0.119159 -2.923089
H  6.947333 0.550468 -1.538759
elementType: S P O N C H
totalener: -1600.38718931 hartree
nucrepener: 1875.44680678 hartree
electener: -3475.83399609 hartree
oneelecener: -5924.03929526 hartree
twoeener: 2448.20529917 hartree
cpcmener: -0.02549379 hartree
kineticenergy: 1595.26715838 hartree
xcener: -117.830685531579 hartree
chargesum: 0.0000000
charge: -0.403675 0.694405 -0.298201 -0.326401 -0.328826 -0.141008 -0.208805 0.326958 -0.005039 0.256552 -0.232996 0.034135 0.033394 -0.183526 -0.193744 -0.156503 -0.151165 -0.243480 -0.231097 -0.130606 0.166168 0.109016 0.098088 0.094980 0.106684 0.148916 0.145794 0.090581 0.105867 0.086625 0.077988 0.093966 0.089620 0.157843 0.157789 0.159705
qa: -0.4037 0.6944 -0.2982 -0.3264 -0.3288 -0.1410 -0.2088 0.3270 -0.0050 0.2566 -0.2330 0.0341 0.0334 -0.1835 -0.1937 -0.1565 -0.1512 -0.2435 -0.2311 -0.1306 0.1662 0.1090 0.0981 0.0950 0.1067 0.1489 0.1458 0.0906 0.1059 0.0866 0.0780 0.0940 0.0896 0.1578 0.1578 0.1597
va: 2.0521 5.5219 2.1603 2.0669 2.1065 2.2398 2.8129 3.8072 3.6673 4.1994 3.9354 3.8438 3.8680 3.9615 3.9600 3.9145 3.9123 3.8978 3.9333 3.8992 1.0108 0.9920 1.0115 0.9989 0.9941 1.0164 1.0081 1.0045 1.0097 1.0163 1.0177 1.0081 1.0044 0.9942 0.9934 0.9898
dispcorr: -0.015966837 hartree
energy: -1600.403156146857
dipole: 1.83981 -0.51675 1.32306 -2.14695 1.74730 -0.39965 -13.37516 10.10804 -3.26712
magnitude: 3.54744 au
magnitude: 9.01687 debye
