program: Orca
programVersion: 5.0.4
elementType: S P O O O O N C C C C C C C C C C C C C H H H H H H H H H H H H H H H H
charge: 0
multiplicity: 1
keywords: wb97x-d3
keywords: def2-TZVPP
keywords: def2/J RIJCOSX
keywords: DEFGRID2
keywords: scfconv7
keywords: smallprint printgap noloewdin
keywords: NOSOSCF
formula: C13H16NO4PS
InChI: InChI=1/C13H16NO4PS/c1-3-15-19(20,16-4-2)18-13-10-12(17-14-13)11-8-6-5-7-9-11/h5-10H,3-4H2,1-2H3
36 atoms
S  -1.65848 -0.022672 1.886602
P  -2.324731 -0.082018 0.097837
O  -1.210642 -0.285016 -1.073022
O  -3.015608 1.213407 -0.509837
O  -3.414744 -1.196939 -0.22103
O  2.011098 -1.303471 -0.84455
N  0.70424 -1.516615 -1.13284
C  2.191793 -0.066521 -0.370076
C  3.54339 0.328926 -0.004193
C  0.107745 -0.403531 -0.836409
C  0.995491 0.57514 -0.340064
C  -4.124596 1.833177 0.152073
C  -3.379799 -2.505101 0.366482
C  3.749003 1.50891 0.709587
C  4.643977 -0.455605 -0.349951
C  5.026729 1.899264 1.067874
C  5.920783 -0.060741 0.01261
C  -4.276297 3.234042 -0.38876
C  -2.38037 -3.413208 -0.312486
C  6.117859 1.114773 0.721238
H  0.766204 1.576649 -0.023078
H  -5.025323 1.243455 -0.03242
H  -3.947709 1.85195 1.231285
H  -3.169926 -2.417401 1.435466
H  -4.393341 -2.888044 0.252199
H  2.904359 2.120539 0.999645
H  4.507507 -1.3735 -0.905065
H  -4.448254 3.229311 -1.464384
H  -5.129618 3.717998 0.086042
H  -3.391504 3.835144 -0.183279
H  -2.548575 -3.455388 -1.38769
H  -1.350293 -3.101475 -0.142865
H  -2.487465 -4.422764 0.085075
H  5.170592 2.81519 1.625159
H  6.766984 -0.67692 -0.260826
H  7.117196 1.418156 1.003577
totalener: -1600.36905347 hartree
nucrepener: 1862.57841759 hartree
electener: -3462.94747106 hartree
oneelecener: -5898.30520492 hartree
twoeener: 2435.35773387 hartree
kineticenergy: 1595.32174211 hartree
xcener: -117.838539852173 hartree
chargesum: -0.0000000
charge: -0.379296 0.685887 -0.309858 -0.303612 -0.315463 -0.126791 -0.165777 0.358250 0.002814 0.277551 -0.259270 0.016388 0.018884 -0.168018 -0.162739 -0.126911 -0.125675 -0.226344 -0.219632 -0.104553 0.131662 0.097842 0.085012 0.090983 0.092185 0.116283 0.133792 0.088836 0.075889 0.083372 0.088235 0.087211 0.080074 0.126736 0.127640 0.128413
qa: -0.3793 0.6859 -0.3099 -0.3036 -0.3155 -0.1268 -0.1658 0.3582 0.0028 0.2776 -0.2593 0.0164 0.0189 -0.1680 -0.1627 -0.1269 -0.1257 -0.2263 -0.2196 -0.1046 0.1317 0.0978 0.0850 0.0910 0.0922 0.1163 0.1338 0.0888 0.0759 0.0834 0.0882 0.0872 0.0801 0.1267 0.1276 0.1284
va: 2.0487 5.5499 2.1539 2.1544 2.1308 2.2605 2.8050 3.6782 3.7452 4.1169 3.9833 3.8729 3.8919 4.0081 4.0076 3.9791 3.9586 3.9555 3.9008 3.9566 1.0124 0.9929 1.0069 1.0123 0.9904 1.0144 1.0212 1.0050 1.0086 1.0078 1.0083 1.0248 1.0115 1.0030 1.0033 0.9995
dispcorr: -0.015181446 hartree
energy: -1600.384234912243
dipole: -6.24584 6.05717 -0.18867 3.43817 -2.66640 0.77177 1.41200 -1.15271 0.25929
magnitude: 0.83573 au
magnitude: 2.12427 debye
