program: Orca
programVersion: 5.0.4
elementType: S P O O O O N C C C C C C C C C C C C C H H H H H H H H H H H H H H H H
charge: 0
multiplicity: 1
keywords: wb97x-d3
keywords: def2-TZVPP
keywords: def2/J RIJCOSX
keywords: DEFGRID2
keywords: scfconv7
keywords: smallprint printgap noloewdin
keywords: NOSOSCF
formula: C13H16NO4PS
InChI: InChI=1/C13H16NO4PS/c1-3-15-19(20,16-4-2)18-13-10-12(17-14-13)11-8-6-5-7-9-11/h5-10H,3-4H2,1-2H3
36 atoms
S  -3.853321 -0.078147 1.829472
P  -2.528332 -0.29704 0.483706
O  -1.058144 0.109293 1.101007
O  -2.668374 0.582984 -0.841355
O  -2.290639 -1.758264 -0.074466
O  1.578842 -0.244641 -1.033047
N  0.247152 -0.344387 -0.772425
C  2.230325 0.212051 0.039338
C  3.672817 0.376838 -0.058934
C  0.110974 0.052433 0.456452
C  1.340804 0.428509 1.041994
C  -3.304975 1.866832 -0.843174
C  -2.39812 -2.175348 -1.445592
C  4.352995 0.098302 -1.244123
C  4.395137 0.816962 1.050034
C  5.726864 0.258158 -1.311953
C  5.766984 0.975834 0.976649
C  -2.45793 2.934849 -0.188454
C  -2.171295 -3.666213 -1.485424
C  6.438348 0.696602 -0.205345
H  1.507173 0.791721 2.040516
H  -3.470881 2.092895 -1.89575
H  -4.277565 1.79005 -0.351822
H  -3.390823 -1.926026 -1.826408
H  -1.653193 -1.649672 -2.041981
H  3.812964 -0.244748 -2.115796
H  3.884424 1.035567 1.978823
H  -2.935479 3.906104 -0.321031
H  -2.354624 2.764112 0.882914
H  -1.465033 2.985233 -0.634611
H  -2.254692 -4.01764 -2.513857
H  -1.176897 -3.921989 -1.121892
H  -2.907879 -4.198984 -0.88513
H  6.243949 0.037588 -2.236101
H  6.313942 1.317892 1.844915
H  7.511557 0.819402 -0.262752
totalener: -1600.36635422 hartree
nucrepener: 1866.75138037 hartree
electener: -3467.11773459 hartree
oneelecener: -5906.68684952 hartree
twoeener: 2439.56911492 hartree
kineticenergy: 1595.31165100 hartree
xcener: -117.838717200866 hartree
chargesum: -0.0000000
charge: -0.347009 0.650497 -0.293589 -0.296131 -0.306065 -0.141636 -0.203722 0.362746 -0.009725 0.310786 -0.272609 0.013305 0.020637 -0.170664 -0.163261 -0.125614 -0.133283 -0.240355 -0.232507 -0.100157 0.135820 0.092202 0.094583 0.094352 0.108341 0.134038 0.115264 0.089063 0.090818 0.087528 0.074076 0.087751 0.087771 0.128383 0.127944 0.130425
qa: -0.3470 0.6505 -0.2936 -0.2961 -0.3061 -0.1416 -0.2037 0.3627 -0.0097 0.3108 -0.2726 0.0133 0.0206 -0.1707 -0.1633 -0.1256 -0.1333 -0.2404 -0.2325 -0.1002 0.1358 0.0922 0.0946 0.0944 0.1083 0.1340 0.1153 0.0891 0.0908 0.0875 0.0741 0.0878 0.0878 0.1284 0.1279 0.1304
va: 2.1285 5.5477 2.1638 2.0715 2.1280 2.2660 2.7625 3.6881 3.7562 4.1097 3.9581 3.8955 3.8541 4.0149 4.0001 3.9593 3.9842 3.8879 3.9536 3.9523 1.0087 0.9917 1.0147 0.9969 0.9984 1.0223 1.0153 1.0138 1.0203 1.0060 1.0083 1.0063 1.0062 1.0033 1.0029 0.9990
dispcorr: -0.015495426 hartree
energy: -1600.381849645198
dipole: 4.63855 -3.16932 1.46923 1.79169 -1.19492 0.59677 -9.42483 8.52846 -0.89637
magnitude: 1.82160 au
magnitude: 4.63014 debye
