program: Orca
programVersion: 5.0.4
elementType: S P O O O O N C C C C C C C C C C C C C H H H H H H H H H H H H H H H H
charge: 0
multiplicity: 1
keywords: wb97x-d3
keywords: def2-TZVPP
keywords: def2/J RIJCOSX
keywords: DEFGRID2
keywords: scfconv7
keywords: smallprint printgap noloewdin
keywords: NOSOSCF
formula: C13H16NO4PS
InChI: InChI=1/C13H16NO4PS/c1-3-15-19(20,16-4-2)18-13-10-12(17-14-13)11-8-6-5-7-9-11/h5-10H,3-4H2,1-2H3
36 atoms
S  -4.018126 -0.854896 1.107152
P  -2.53823 -0.35039 0.017041
O  -1.265208 0.067718 0.966973
O  -2.716417 0.848531 -1.00192
O  -1.917582 -1.421951 -0.985351
O  1.476328 1.495665 -0.462148
N  0.14158 1.466078 -0.224531
C  2.082276 0.458141 0.120569
C  3.525859 0.346804 -0.025383
C  -0.051276 0.401492 0.492183
C  1.148088 -0.295842 0.756912
C  -3.555041 1.97869 -0.72472
C  -2.033072 -2.830595 -0.758126
C  4.210292 -0.682204 0.620968
C  4.24452 1.256628 -0.80121
C  5.582518 -0.800428 0.494579
C  5.618386 1.134954 -0.92257
C  -2.994743 2.890095 0.343518
C  -1.10183 -3.325374 0.325554
C  6.291854 0.108165 -0.278072
H  1.27085 -1.197205 1.330424
H  -3.628884 2.499729 -1.677929
H  -4.552305 1.624977 -0.451936
H  -3.06944 -3.078362 -0.518128
H  -1.788425 -3.287036 -1.716208
H  3.669769 -1.394056 1.231259
H  3.734341 2.06224 -1.310942
H  -3.618656 3.781956 0.410886
H  -2.997661 2.415066 1.324478
H  -1.977731 3.198292 0.107991
H  -1.370809 -2.922134 1.302117
H  -1.16778 -4.411937 0.390265
H  -0.066205 -3.065744 0.106319
H  6.100677 -1.602533 1.002707
H  6.165163 1.846954 -1.526126
H  7.365242 0.016565 -0.375961
totalener: -1600.36610617 hartree
nucrepener: 1885.41139742 hartree
electener: -3485.77750359 hartree
oneelecener: -5943.86919940 hartree
twoeener: 2458.09169581 hartree
kineticenergy: 1595.32329174 hartree
xcener: -117.840073506436 hartree
chargesum: 0.0000000
charge: -0.369682 0.672761 -0.316211 -0.289185 -0.310554 -0.130495 -0.173806 0.382869 -0.011038 0.293142 -0.290248 0.013897 0.024528 -0.166742 -0.166780 -0.129348 -0.124141 -0.249906 -0.260310 -0.101736 0.135804 0.095569 0.094472 0.093670 0.098001 0.113375 0.135296 0.087993 0.089365 0.101440 0.098359 0.095534 0.078436 0.127039 0.128512 0.130122
qa: -0.3697 0.6728 -0.3162 -0.2892 -0.3106 -0.1305 -0.1738 0.3829 -0.0110 0.2931 -0.2902 0.0139 0.0245 -0.1667 -0.1668 -0.1293 -0.1241 -0.2499 -0.2603 -0.1017 0.1358 0.0956 0.0945 0.0937 0.0980 0.1134 0.1353 0.0880 0.0894 0.1014 0.0984 0.0955 0.0784 0.1270 0.1285 0.1301
va: 2.0721 5.5349 2.1155 2.1546 2.1257 2.2696 2.8110 3.6750 3.7722 4.1047 3.9719 3.8885 3.8847 4.0007 4.0124 3.9822 3.9568 3.8804 3.8923 3.9542 1.0035 0.9926 1.0094 1.0136 0.9918 1.0154 1.0220 1.0125 1.0159 1.0169 1.0137 1.0155 1.0019 1.0031 1.0033 0.9991
dispcorr: -0.016418509 hartree
energy: -1600.382524680103
dipole: 5.96689 -4.47611 1.49078 -3.03781 2.43480 -0.60301 -0.62218 0.39699 -0.22519
magnitude: 1.62381 au
magnitude: 4.12740 debye
