program: Orca
programVersion: 5.0.4
elementType: S P O O O O N C C C C C C C C C C C C C H H H H H H H H H H H H H H H H
charge: 0
multiplicity: 1
keywords: wb97x-d3
keywords: def2-TZVPP
keywords: def2/J RIJCOSX
keywords: DEFGRID2
keywords: scfconv7
keywords: smallprint printgap noloewdin
keywords: NOSOSCF
formula: C13H16NO4PS
InChI: InChI=1/C13H16NO4PS/c1-3-15-19(20,16-4-2)18-13-10-12(17-14-13)11-8-6-5-7-9-11/h5-10H,3-4H2,1-2H3
36 atoms
S  -4.083891 -0.173971 0.948847
P  -2.327571 0.006047 0.23509
O  -1.175429 -0.013298 1.382034
O  -1.969643 1.370677 -0.51266
O  -1.832944 -1.086208 -0.81889
O  2.067409 -0.987213 1.246157
N  0.788174 -1.123788 1.678008
C  2.170526 0.045857 0.406591
C  3.479188 0.340216 -0.157154
C  0.13362 -0.163846 1.100783
C  0.953144 0.630588 0.267632
C  -2.970145 2.147182 -1.185163
C  -2.333707 -2.433722 -0.810492
C  4.638926 -0.215584 0.381947
C  3.58063 1.193723 -1.25514
C  5.873712 0.085601 -0.167943
C  4.816697 1.49171 -1.80004
C  -3.427397 1.513288 -2.478704
C  -1.877251 -3.232976 0.388897
C  5.967769 0.938179 -1.25766
H  0.67702 1.495076 -0.308063
H  -3.815371 2.306024 -0.512012
H  -2.498097 3.1118 -1.367502
H  -3.424597 -2.407884 -0.864078
H  -1.958539 -2.868991 -1.735721
H  4.581138 -0.876299 1.236132
H  2.686759 1.616414 -1.695438
H  -4.101765 2.195856 -2.996532
H  -2.58806 1.300701 -3.139615
H  -3.973553 0.587296 -2.299179
H  -0.793399 -3.226362 0.493579
H  -2.314655 -2.858323 1.313965
H  -2.200897 -4.26758 0.269384
H  6.768015 -0.347131 0.259852
H  4.88109 2.152338 -2.654169
H  6.934528 1.169103 -1.684551
totalener: -1600.36709178 hartree
nucrepener: 1887.25552941 hartree
electener: -3487.62262118 hartree
oneelecener: -5947.35988367 hartree
twoeener: 2459.73726249 hartree
kineticenergy: 1595.32710877 hartree
xcener: -117.839984220249 hartree
chargesum: 0.0000000
charge: -0.352861 0.676986 -0.288709 -0.321304 -0.309328 -0.124603 -0.159893 0.337534 0.010711 0.213712 -0.238448 0.002590 0.018054 -0.160302 -0.169933 -0.126037 -0.128208 -0.219491 -0.233978 -0.104577 0.138294 0.098219 0.090901 0.091992 0.096616 0.134438 0.113588 0.085351 0.087024 0.081864 0.093851 0.095056 0.086526 0.127692 0.126767 0.129905
qa: -0.3529 0.6770 -0.2887 -0.3213 -0.3093 -0.1246 -0.1599 0.3375 0.0107 0.2137 -0.2384 0.0026 0.0181 -0.1603 -0.1699 -0.1260 -0.1282 -0.2195 -0.2340 -0.1046 0.1383 0.0982 0.0909 0.0920 0.0966 0.1344 0.1136 0.0854 0.0870 0.0819 0.0939 0.0951 0.0865 0.1277 0.1268 0.1299
va: 2.0941 5.5129 2.1728 2.1130 2.0744 2.2571 2.7925 3.6818 3.7282 4.2013 3.9347 3.9078 3.8776 4.0062 4.0105 3.9611 3.9823 3.8779 3.8908 3.9571 1.0152 1.0129 0.9923 1.0098 0.9914 1.0205 1.0151 1.0114 1.0069 1.0220 1.0139 1.0193 1.0127 1.0033 1.0030 0.9991
dispcorr: -0.016242383 hartree
energy: -1600.383334158522
dipole: 0.52015 0.32458 0.84474 -0.63424 1.26199 0.62775 -14.34843 12.52710 -1.82133
magnitude: 2.10354 au
magnitude: 5.34679 debye
