program: Orca
programVersion: 5.0.4
elementType: S P O O O O N C C C C C C C C C C C C C H H H H H H H H H H H H H H H H
charge: 0
multiplicity: 1
keywords: wb97x-d3
keywords: def2-TZVPP
keywords: def2/J RIJCOSX
keywords: DEFGRID2
keywords: scfconv7
keywords: smallprint printgap noloewdin
keywords: NOSOSCF
formula: C13H16NO4PS
InChI: InChI=1/C13H16NO4PS/c1-3-15-19(20,16-4-2)18-13-10-12(17-14-13)11-8-6-5-7-9-11/h5-10H,3-4H2,1-2H3
36 atoms
S  -2.023389 -0.210931 2.383031
P  -2.415396 -0.645457 0.567336
O  -1.241579 -1.445015 -0.253872
O  -2.72774 0.57952 -0.404336
O  -3.60791 -1.662904 0.364775
O  1.518615 -0.000152 -1.588689
N  0.262394 -0.499901 -1.690905
C  1.951134 -0.064186 -0.325235
C  3.285918 0.439436 -0.039686
C  -0.048977 -0.868995 -0.486944
C  0.980834 -0.620712 0.446433
C  -2.618798 1.959968 -0.032527
C  -3.857043 -2.480591 -0.791098
C  4.08335 0.982094 -1.047534
C  3.781482 0.384997 1.262841
C  5.349669 1.458239 -0.751577
C  5.047338 0.861741 1.55256
C  -1.212017 2.482402 -0.206035
C  -4.172006 -1.698852 -2.046522
C  5.836218 1.400769 0.545826
H  0.970577 -0.824898 1.502294
H  -3.313695 2.481876 -0.689773
H  -2.958303 2.092097 0.996799
H  -3.010538 -3.14989 -0.951904
H  -4.710266 -3.092283 -0.50113
H  3.719101 1.033873 -2.064319
H  3.175155 -0.031483 2.056822
H  -1.200427 3.557927 -0.026207
H  -0.527113 2.021822 0.505892
H  -0.842417 2.302906 -1.214915
H  -3.30872 -1.15504 -2.426309
H  -4.486363 -2.399404 -2.821522
H  -4.985652 -0.993022 -1.884354
H  5.959468 1.87676 -1.540924
H  5.418673 0.813198 2.56735
H  6.826168 1.774142 0.772424
totalener: -1600.36582103 hartree
nucrepener: 1902.45176176 hartree
electener: -3502.81758279 hartree
oneelecener: -5977.88329830 hartree
twoeener: 2475.06571551 hartree
kineticenergy: 1595.31124680 hartree
xcener: -117.839126328265 hartree
chargesum: 0.0000000
charge: -0.369670 0.677385 -0.321584 -0.299101 -0.309863 -0.125407 -0.144155 0.352656 0.006562 0.224958 -0.258024 0.023217 0.020160 -0.170970 -0.172898 -0.118867 -0.119586 -0.234655 -0.235249 -0.108628 0.138599 0.093625 0.093016 0.091115 0.099015 0.134395 0.118249 0.092309 0.078837 0.096295 0.091552 0.084744 0.085688 0.128326 0.128059 0.129893
qa: -0.3697 0.6774 -0.3216 -0.2991 -0.3099 -0.1254 -0.1442 0.3527 0.0066 0.2250 -0.2580 0.0232 0.0202 -0.1710 -0.1729 -0.1189 -0.1196 -0.2347 -0.2352 -0.1086 0.1386 0.0936 0.0930 0.0911 0.0990 0.1344 0.1182 0.0923 0.0788 0.0963 0.0916 0.0847 0.0857 0.1283 0.1281 0.1299
va: 2.0715 5.5205 2.1180 2.0953 2.1774 2.2573 2.8070 3.6766 3.7438 4.1573 3.9929 3.8825 3.9067 4.0113 4.0083 3.9513 3.9735 3.8922 3.9153 3.9597 1.0178 0.9926 1.0144 0.9980 0.9855 1.0220 1.0145 1.0143 1.0153 1.0078 1.0167 1.0109 1.0071 1.0032 1.0028 0.9993
dispcorr: -0.017215310 hartree
energy: -1600.383036338659
dipole: -0.25883 0.79843 0.53960 7.22781 -6.79366 0.43415 -6.49216 6.13077 -0.36140
magnitude: 0.78119 au
magnitude: 1.98564 debye
