program: Gaussian 09
title: 000065786
version: EM64L-G09RevD.01
frameworkgroup: C1[X(C13H16N2O3)]
method: RPBEPBE
basis: SDD
operation: Freq
keyword: #p
keyword: freq=noraman
keyword: PBEPBE/SDD
title: #p freq=noraman PBEPBE/SDD
converged: YES YES NO NO
title: Mulliken charges:
elementType: O O O N N C C C C C C C C C C C C C H H H H H H H H H H H H H H H H
charge: -0.241221 -0.263098 -0.290047 -0.289013 -0.398042 -0.241639 -0.392813 0.532509 0.279224 0.312455 -0.365490 -0.449607 -0.361560 -0.342908 -0.225773 -0.216484 -0.234134 -0.684012 0.252996 0.273867 0.269668 0.241692 0.233478 0.210135 0.250313 0.361612 0.202576 0.224057 0.231860 0.232820 0.234635 0.222725 0.206793 0.222428
chargesum: 0.00000
title: Mulliken charges with hydrogens summed into heavy atoms:
elementType: O O O N N C C C C C C C C C C C C C
charge: -0.241221 -0.263098 -0.290047 -0.289013 -0.036430 0.011357 0.150722 0.532509 0.279224 0.312455 -0.123797 -0.216130 0.098888 0.083725 0.006087 0.016336 0.000501 -0.032066
polarizability: 2.30098494e+02 5.51112964e+00 1.34464326e+02 1.00234998e+01 -5.64909192e+00 1.21074632e+02
1716.lowfreq: 0.0005 0.0006 0.0008 3.4057 5.0470 10.0354 20.5776 22.7907 33.9304
frequency: 19.6634 22.5616 33.6565 57.4920 62.6363 88.1638 105.3650 149.0343 168.1164 208.9679 222.7235 234.4753 247.6891 267.2590 288.8752 345.6557 383.4021 402.7093 413.8462 496.5807 509.0725 580.3699 612.9676 614.3968 655.6142 681.0156 688.7054 703.9932 710.5565 743.6481 752.4855 773.5588 788.7288 799.8238 852.9101 865.8572 894.7972 904.5288 926.1883 964.9660 978.4197 988.5480 994.0759 1001.1415 1019.7095 1027.1069 1056.3729 1079.4600 1093.5984 1098.6635 1142.7528 1167.3878 1175.6926 1188.4382 1190.5863 1203.2485 1222.5576 1250.2782 1259.4902 1285.0239 1292.7390 1309.5714 1340.5819 1343.0642 1359.9188 1365.8186 1391.8801 1393.9773 1447.4587 1457.1502 1463.3356 1479.4863 1486.0193 1487.3888 1493.6742 1534.8768 1597.8493 1617.1608 1631.4867 1686.1723 2975.6518 2987.0344 3000.6405 3019.8943 3029.2914 3041.3502 3071.7488 3077.5554 3079.5259 3104.8453 3122.0984 3128.9279 3140.0950 3152.8865 3168.7424 3401.1764
redmass: 3.6495 4.1270 4.0626 4.0506 4.9456 3.7668 2.9175 4.6090 3.3711 6.0969 1.8008 1.9612 5.0388 4.8701 5.0673 2.5554 6.3345 2.7979 3.9785 2.7046 4.0414 3.7815 5.9771 6.2669 4.8274 6.6030 5.8723 1.7220 5.8338 1.2397 1.9525 1.8924 2.3192 3.8185 1.2544 2.2370 3.1988 2.1678 1.4896 2.4193 1.3958 3.0144 2.9360 1.3676 3.3046 2.1354 2.6059 2.9828 1.6645 2.1062 2.0582 1.6856 1.0552 2.7994 1.2082 1.7304 1.9867 1.6463 2.2129 1.2095 1.2469 1.6909 1.5694 1.3799 1.2681 1.8760 1.2301 4.1925 2.1046 1.0957 1.0748 1.0504 1.0762 2.1886 1.1156 1.7053 6.0211 6.0917 10.3474 7.5784 1.0360 1.0612 1.0642 1.0688 1.0826 1.0983 1.0998 1.1003 1.1015 1.1015 1.0879 1.0867 1.0913 1.0961 1.1016 1.0807
irintensity: 0.1730 0.2272 0.2285 0.5740 0.3746 6.2097 4.0045 5.0881 7.1150 1.2114 0.3118 3.3966 0.9917 6.7615 14.4257 15.2484 0.4026 0.5361 1.2522 8.3757 12.1979 6.9567 0.6699 11.7544 5.6281 5.2035 18.9172 50.3092 3.6279 96.2528 58.5215 48.9475 20.5862 11.8180 0.7474 14.6829 47.3087 70.4713 4.9967 26.5656 0.0604 14.7070 6.8817 0.8661 120.9904 6.1171 3.0299 48.5000 7.7491 8.1230 11.2016 183.3950 0.9266 116.7039 9.8057 55.4040 12.3420 73.4650 163.5535 35.4347 7.2746 105.0670 95.3102 2.6038 3.0909 11.3678 26.0726 1.5179 12.8684 19.2994 6.4608 14.0379 24.1888 10.4709 40.1250 505.2607 0.5065 0.1195 21.4828 572.1347 31.4436 29.8370 38.7767 15.7381 23.2367 13.7233 48.5889 55.5703 31.9236 7.2615 7.1275 2.5217 11.5871 32.4428 19.2570 124.4671
temp: 298.150 k
press: 1.00000 atm
elementType: 8 8 8 7 7 6 6 6 6 6 6 6 6 6 6 6 6 6 1 1 1 1 1 1 1 1 1 1 1 1 1 1 1 1
symmnumber: 1
zpe: 719833.0 jmol-1
zpe.correction: 0.274170 hartree
zpe.thermalcorrener: 0.291186 hartree
zpe.thermalcorrenthalpy: 0.292131 hartree
zpe.thermalcorrgfe: 0.226373 hartree
zpe.sumelectzpe: -838.860638 hartree
zpe.sumelectthermal: -838.843622 hartree
zpe.sumelectthermalent: -838.842678 hartree
zpe.sumelectthermalfe: -838.908435 hartree
dipole: -2.0388 -0.6424 -1.1793
dipole: 2.4414
quadrupole: -82.1933 -107.6637 -115.8843
quadrupole: 5.1994 4.5816 -13.7139
quadrupole: 19.7205 -5.7499 -13.9705 5.1994 4.5816 -13.7139
hfenergy: -839.1348082 hartree
pointgroup: C01 [X(C13H16N2O3)]
dipole: -0.7995469 0.4422249 0.2961839 debye
polarizability: 229.8919989|-11.394648|128.3486053|-4.4340069|-8.8853743|127.3968476 unknown
InChI: InChI=1S/C13H16N2O3/c1-2-8-14-12(16)15-9-11(18-13(15)17)10-6-4-3-5-7-10/h3-7,11,14H,2,8-9H2,1H3
charge 0 multiplicity 1
34 atoms
O  -0.717654 -0.956975 -1.205028
O  1.486264 -1.733995 -1.305855
O  2.274752 2.0795 0.511619
N  0.934999 0.415755 -0.433074
N  3.290978 0.152062 -0.374741
C  -1.373766 0.383919 -0.920191
C  -0.30165 1.147037 -0.088852
C  -2.705265 0.178417 -0.238678
C  0.666516 -0.835264 -1.00685
C  2.221098 0.948633 -0.056061
C  -2.79484 -0.548112 0.975951
C  -3.879583 0.727345 -0.806942
C  4.665273 0.55153 -0.02537
C  5.149067 -0.037954 1.32218
C  -4.041891 -0.717128 1.612545
C  -5.128117 0.568618 -0.164044
C  -5.211324 -0.154201 1.047156
C  5.211636 -1.580246 1.33016
H  -1.513052 0.860706 -1.907242
H  -0.223996 2.207331 -0.37185
H  -0.498276 1.091638 0.996527
H  -1.895138 -1.001771 1.407892
H  -3.819099 1.278322 -1.753778
H  5.334255 0.220687 -0.842763
H  4.690468 1.65401 0.018332
H  3.100105 -0.765484 -0.802142
H  6.153675 0.37969 1.53315
H  4.478656 0.322682 2.125318
H  -4.105709 -1.287942 2.545308
H  -6.030934 1.000166 -0.609435
H  -6.178899 -0.283937 1.544348
H  4.216027 -2.023989 1.144124
H  5.901862 -1.956428 0.550903
H  5.56796 -1.958623 2.305179
