program: Orca
programVersion: 5.0.4
elementType: S P O O O O N C C C C C C C C C C C C C H H H H H H H H H H H H H H H H
charge: 0
multiplicity: 1
keywords: wb97x-d3
keywords: def2-TZVPP
keywords: def2/J RIJCOSX
keywords: DEFGRID2
keywords: scfconv7
keywords: smallprint printgap noloewdin
keywords: NOSOSCF
formula: C13H16NO4PS
InChI: InChI=1/C13H16NO4PS/c1-3-15-19(20,16-4-2)18-13-10-12(17-14-13)11-8-6-5-7-9-11/h5-10H,3-4H2,1-2H3
36 atoms
S  -1.969645 1.030806 1.68666
P  -2.352109 0.56064 -0.132194
O  -1.233235 0.959041 -1.2444
O  -3.55446 1.301174 -0.855302
O  -2.614204 -0.984602 -0.412879
O  1.758969 -0.586852 -1.648146
N  0.467751 -0.369087 -2.002373
C  2.083463 0.142499 -0.575913
C  3.439169 0.033125 -0.058729
C  0.027412 0.496863 -1.142339
C  1.004269 0.873878 -0.194808
C  -4.711644 1.734138 -0.129682
C  -2.356823 -2.037226 0.526404
C  3.75456 0.609987 1.17128
C  4.434988 -0.635514 -0.770523
C  5.039666 0.527486 1.676099
C  5.719763 -0.716103 -0.259485
C  -5.57049 0.585105 0.350656
C  -0.904209 -2.451758 0.542809
C  6.027597 -0.135492 0.961734
H  0.899462 1.574919 0.613309
H  -4.399727 2.360838 0.709218
H  -5.258445 2.359174 -0.833973
H  -2.682221 -1.729592 1.522745
H  -2.992513 -2.859586 0.199957
H  2.989495 1.119954 1.742287
H  4.211905 -1.088589 -1.726798
H  -6.494534 0.978612 0.775001
H  -5.832626 -0.086541 -0.465804
H  -5.073635 0.009723 1.132054
H  -0.547918 -2.695041 -0.457145
H  -0.270386 -1.669258 0.960225
H  -0.789488 -3.336984 1.169432
H  5.269942 0.979311 2.631583
H  6.485296 -1.234143 -0.821369
H  7.032919 -0.199454 1.356038
totalener: -1600.36738520 hartree
nucrepener: 1894.32909813 hartree
electener: -3494.69648333 hartree
oneelecener: -5961.58707847 hartree
twoeener: 2466.89059514 hartree
kineticenergy: 1595.32298365 hartree
xcener: -117.840872323937 hartree
chargesum: 0.0000000
charge: -0.401295 0.684348 -0.287010 -0.304969 -0.303971 -0.123824 -0.133029 0.341038 0.012290 0.191025 -0.243238 0.018987 0.030675 -0.171017 -0.169630 -0.124520 -0.121944 -0.235249 -0.239149 -0.106042 0.135368 0.093170 0.098162 0.088726 0.099813 0.119433 0.134603 0.086974 0.095021 0.077624 0.101888 0.078304 0.092296 0.127871 0.127824 0.129444
qa: -0.4013 0.6843 -0.2870 -0.3050 -0.3040 -0.1238 -0.1330 0.3410 0.0123 0.1910 -0.2432 0.0190 0.0307 -0.1710 -0.1696 -0.1245 -0.1219 -0.2352 -0.2391 -0.1060 0.1354 0.0932 0.0982 0.0887 0.0998 0.1194 0.1346 0.0870 0.0950 0.0776 0.1019 0.0783 0.0923 0.1279 0.1278 0.1294
va: 2.0153 5.5467 2.1923 2.1560 2.1151 2.2546 2.8108 3.6832 3.7225 4.1947 3.9671 3.8884 3.8577 4.0061 4.0116 3.9784 3.9540 3.8921 3.9134 3.9577 1.0161 1.0115 0.9919 1.0111 0.9916 1.0129 1.0208 1.0114 1.0060 1.0163 1.0087 1.0124 1.0134 1.0028 1.0033 0.9994
dispcorr: -0.016910270 hartree
energy: -1600.384295468310
dipole: -4.40842 4.49350 0.08508 -7.46063 7.19594 -0.26470 8.46846 -7.51409 0.95438
magnitude: 0.99405 au
magnitude: 2.52667 debye
