program: Orca
programVersion: 5.0.4
elementType: S P O O O O N C C C C C C C C C C C C C H H H H H H H H H H H H H H H H
charge: 0
multiplicity: 1
keywords: wb97x-d3
keywords: def2-TZVPP
keywords: def2/J RIJCOSX
keywords: DEFGRID2
keywords: scfconv7
keywords: smallprint printgap noloewdin
keywords: NOSOSCF
formula: C13H16NO4PS
InChI: InChI=1/C13H16NO4PS/c1-3-15-19(20,16-4-2)18-13-10-12(17-14-13)11-8-6-5-7-9-11/h5-10H,3-4H2,1-2H3
36 atoms
S  -2.793345 -0.520251 1.728926
P  -2.521455 -0.153284 -0.123972
O  -1.164784 0.68046 -0.519196
O  -3.58144 0.802968 -0.828094
O  -2.429904 -1.361496 -1.144232
O  1.715045 -0.974648 0.235979
N  0.361552 -0.948652 0.116113
C  2.234894 0.211147 -0.088115
C  3.680826 0.359864 -0.018426
C  0.079886 0.254682 -0.27755
C  1.230714 1.05914 -0.430978
C  -4.320602 1.798283 -0.113025
C  -2.917395 -2.679209 -0.8411
C  4.267905 1.578191 -0.358247
C  4.496813 -0.697479 0.383283
C  5.640382 1.737457 -0.298242
C  5.870536 -0.532762 0.441468
C  -3.474645 2.992315 0.267389
C  -1.810959 -3.573235 -0.33648
C  6.447248 0.681871 0.10237
H  1.278379 2.086946 -0.743755
H  -5.12122 2.089052 -0.792318
H  -4.773846 1.349024 0.773726
H  -3.728116 -2.623311 -0.110975
H  -3.334533 -3.051656 -1.776645
H  3.650032 2.408863 -0.673515
H  4.062857 -1.650512 0.652338
H  -2.720068 2.728086 1.007894
H  -2.976943 3.421106 -0.60165
H  -4.111434 3.761005 0.706208
H  -2.20342 -4.580718 -0.191406
H  -0.987232 -3.626225 -1.046656
H  -1.417971 -3.21597 0.613125
H  6.081865 2.688013 -0.565782
H  6.493224 -1.359717 0.755134
H  7.520783 0.806065 0.149465
totalener: -1600.36830384 hartree
nucrepener: 1865.76406074 hartree
electener: -3466.13236458 hartree
oneelecener: -5904.99745382 hartree
twoeener: 2438.86508924 hartree
kineticenergy: 1595.33075010 hartree
xcener: -117.843295840859 hartree
chargesum: -0.0000000
charge: -0.376500 0.705500 -0.308899 -0.314229 -0.311038 -0.139936 -0.191831 0.362217 -0.009990 0.328317 -0.277417 0.011478 0.023693 -0.162864 -0.169623 -0.133125 -0.125986 -0.229638 -0.218484 -0.100770 0.131223 0.093939 0.090308 0.079898 0.093431 0.112729 0.135790 0.083869 0.087308 0.084723 0.084273 0.083483 0.093574 0.126865 0.128162 0.129552
qa: -0.3765 0.7055 -0.3089 -0.3142 -0.3110 -0.1399 -0.1918 0.3622 -0.0100 0.3283 -0.2774 0.0115 0.0237 -0.1629 -0.1696 -0.1331 -0.1260 -0.2296 -0.2185 -0.1008 0.1312 0.0939 0.0903 0.0799 0.0934 0.1127 0.1358 0.0839 0.0873 0.0847 0.0843 0.0835 0.0936 0.1269 0.1282 0.1296
va: 2.0448 5.5165 2.1897 2.1391 2.1339 2.2723 2.8094 3.6998 3.7549 4.1075 3.9616 3.9070 3.8915 3.9983 4.0145 3.9835 3.9586 3.8810 3.8912 3.9518 1.0092 0.9918 1.0138 1.0142 0.9941 1.0155 1.0220 1.0220 1.0065 1.0117 1.0111 1.0102 1.0203 1.0031 1.0034 0.9992
dispcorr: -0.015271392 hartree
energy: -1600.383575231303
dipole: -0.12048 0.72237 0.60189 1.68568 -0.93305 0.75263 -1.54198 0.94016 -0.60182
magnitude: 1.13618 au
magnitude: 2.88794 debye
